program: Gaussian 09
title: 000278440
version: EM64L-G09RevD.01
frameworkgroup: C1[X(C8H17N3O)]
method: RPBEPBE
basis: SDD
operation: Freq
keyword: #p
keyword: freq=noraman
keyword: PBEPBE/SDD
title: #p freq=noraman PBEPBE/SDD
converged: YES YES NO NO
title: Mulliken charges:
elementType: O N N N C C C C C C C C H H H H H H H H H H H H H H H H H
charge: -0.252424 0.042308 -0.409993 -0.654088 0.001894 -0.517553 -0.365349 -0.727889 0.148679 -0.709879 -0.820615 0.295185 0.183295 0.201012 0.238148 0.227066 0.197015 0.219952 0.208402 0.213322 0.201956 0.220007 0.214364 0.234932 0.254853 0.231567 0.284003 0.342862 0.296969
chargesum: 0.00000
title: Mulliken charges with hydrogens summed into heavy atoms:
elementType: O N N N C C C C C C C C
charge: -0.252424 0.042308 -0.125990 -0.014257 0.185189 -0.078392 0.058731 -0.086213 0.148679 -0.073551 -0.099264 0.295185
polarizability: 1.59031289e+02 1.35306563e+01 1.02083161e+02 5.75599825e+00 -9.26538474e+00 9.66636941e+01
1716.lowfreq: -12.9097 -0.0006 0.0002 0.0006 4.7047 5.8656 17.6375 29.8307 51.0493
frequency: 16.8052 29.7793 51.0284 62.9670 99.2887 115.0152 142.1470 169.2698 195.0908 225.7928 235.9848 257.8646 274.3955 292.1122 334.1487 361.4664 405.6166 450.2909 457.4291 484.9721 515.7484 563.0033 591.8676 637.1036 711.8715 757.2034 793.8502 811.7284 902.8074 913.7047 937.3621 964.4043 982.3093 990.6152 1014.2831 1039.8807 1046.0277 1079.5142 1128.8011 1136.7967 1159.0002 1209.9800 1263.1970 1269.3179 1284.7134 1295.5288 1306.1195 1339.6088 1345.0190 1381.9700 1383.9656 1390.8493 1445.8668 1454.4686 1465.6817 1472.0150 1474.9592 1478.8774 1483.9820 1488.2861 1504.2939 1599.9828 1604.6697 1682.0640 2939.9704 2950.7622 2962.0969 2970.1743 2972.5719 2974.5196 3020.5934 3025.5788 3052.5841 3061.3064 3065.9748 3072.0143 3077.8463 3097.3666 3414.1358 3537.8096 3697.0688
redmass: 4.2403 3.0462 2.4752 2.2840 3.8216 1.9237 1.8669 1.8760 1.0432 1.4116 1.9065 1.5991 3.5523 2.8196 3.7121 2.1918 2.1008 1.8015 2.2655 1.3776 1.8989 2.2433 3.7586 3.8209 8.4782 1.4589 1.6498 3.0089 1.7058 1.7603 2.5500 1.2223 1.6370 1.7357 1.5354 2.4996 2.9378 2.2118 2.1893 2.4616 1.9669 1.4257 1.6604 1.2610 1.9916 2.2353 1.3303 1.5091 1.5330 1.2278 1.2252 1.2031 1.1306 1.1541 1.0659 1.0444 1.0466 1.0649 1.0546 1.0512 1.5194 1.9171 2.3343 5.4767 1.0821 1.0401 1.0634 1.0392 1.0393 1.0567 1.0974 1.0994 1.0970 1.0991 1.0990 1.0994 1.0980 1.0950 1.0746 1.0459 1.1034
irintensity: 13.6722 4.9426 1.1334 0.2739 5.2406 0.9722 3.3644 1.2793 0.0023 0.2044 2.7823 12.2156 0.3290 1.0390 21.4503 3.6261 0.0500 190.7866 36.2159 87.9852 20.6223 60.9938 11.4251 12.8998 17.3271 7.1392 0.7034 1.5198 1.4205 3.6977 0.7635 6.7633 4.0081 7.1976 3.5480 33.3948 0.9564 48.1912 30.1244 68.1995 24.8978 13.0246 10.6870 22.7173 75.0291 263.1754 10.8495 2.9278 0.9351 28.9922 21.2187 12.9037 66.1263 111.1048 7.1054 13.1117 15.4981 4.4727 21.1662 6.8704 213.4212 96.4888 36.6136 307.9537 22.0139 19.1455 32.4047 40.8851 53.2576 15.2739 21.1090 11.0891 3.1227 23.4453 98.5586 49.7766 43.7981 16.9381 15.8112 40.6883 40.8750
temp: 298.150 k
press: 1.00000 atm
elementType: 8 7 7 7 6 6 6 6 6 6 6 6 1 1 1 1 1 1 1 1 1 1 1 1 1 1 1 1 1
symmnumber: 1
zpe: 651110.3 jmol-1
zpe.correction: 0.247995 hartree
zpe.thermalcorrener: 0.263396 hartree
zpe.thermalcorrenthalpy: 0.264340 hartree
zpe.thermalcorrgfe: 0.203701 hartree
zpe.sumelectzpe: -553.543378 hartree
zpe.sumelectthermal: -553.527977 hartree
zpe.sumelectthermalent: -553.527033 hartree
zpe.sumelectthermalfe: -553.587671 hartree
dipole: 0.0642 -3.8887 4.8160
dipole: 6.1904
quadrupole: -62.4494 -75.2046 -76.2391
quadrupole: -6.9158 14.9137 0.3485
quadrupole: 8.8483 -3.9069 -4.9414 -6.9158 14.9137 0.3485
hfenergy: -553.7913728 hartree
pointgroup: C01 [X(C8H17N3O1)]
dipole: 0.0685293 -1.4475027 -1.9574409 debye
polarizability: 158.6033384|-13.8671799|101.1381016|7.8159246|8.8882729|98.036704 unknown
InChI: InChI=1S/C8H17N3O/c1-4-6(2)5-7(3)10-11-8(9)12/h6,11H,4-5,9H2,1-3H3
charge 0 multiplicity 1
29 atoms
O  -3.207724 1.257769 0.998127
N  -0.906884 -0.254633 0.371869
N  -2.069533 -0.290559 -0.390406
N  -4.283941 0.315497 -0.843241
C  2.579507 -0.22644 0.119533
C  1.3687 -0.920373 0.823387
C  2.307189 1.289319 -0.074548
C  3.871795 -0.486821 0.92927
C  0.115237 -0.987699 -0.024715
C  3.325187 2.001349 -0.992194
C  0.109852 -1.879784 -1.260147
C  -3.183891 0.487891 0.005818
H  2.70777 -0.682035 -0.887483
H  1.669813 -1.95152 1.104556
H  1.12898 -0.375285 1.754821
H  1.288094 1.422534 -0.486614
H  2.296282 1.776534 0.922182
H  4.75435 -0.030061 0.446944
H  4.068657 -1.5707 1.033165
H  3.784356 -0.060502 1.94728
H  3.357478 1.526902 -1.99214
H  3.053668 3.063612 -1.13348
H  4.348042 1.97345 -0.574114
H  -0.029078 -1.29662 -2.194071
H  1.063032 -2.423718 -1.351877
H  -0.700819 -2.636261 -1.213906
H  -2.128282 -0.857771 -1.245988
H  -5.115296 0.855891 -0.619145
H  -4.313841 -0.33427 -1.626185
