program: Gaussian 09
title: 000278438
version: EM64L-G09RevD.01
frameworkgroup: C1[X(C8H9ClN2O2)]
method: RPBEPBE
basis: SDD
operation: Freq
keyword: #p
keyword: freq=noraman
keyword: PBEPBE/SDD
title: #p freq=noraman PBEPBE/SDD
converged: YES YES NO NO
title: Mulliken charges:
elementType: Cl O O N N C C C C C C C C H H H H H H H H H
charge: -0.061851 -0.307663 -0.211561 -0.430222 0.000951 -0.243721 0.218311 -0.359578 -0.565040 0.276888 -0.150105 -0.191600 -0.324697 0.240270 0.252329 0.341627 0.264250 0.301980 0.228883 0.240731 0.234525 0.245292
chargesum: 0.00000
title: Mulliken charges with hydrogens summed into heavy atoms:
elementType: Cl O O N N C C C C C C C C
charge: -0.061851 -0.307663 -0.211561 -0.088595 0.000951 0.248878 0.218311 -0.130695 0.001190 0.276888 0.090626 0.042925 -0.079404
polarizability: 1.71850277e+02 -5.55662302e+00 1.12562339e+02 1.45256224e+01 1.16885114e+01 6.78535411e+01
1716.lowfreq: -10.2516 -4.3863 -3.5916 0.0003 0.0007 0.0011 16.1999 28.9970 52.2777
frequency: 15.5837 28.9551 52.2661 67.1343 105.0650 138.0715 211.4086 221.9075 277.1325 332.8144 366.4464 404.6003 459.4928 516.2092 593.4032 608.0078 637.4814 641.6116 668.4597 707.3861 736.4813 784.9550 808.2668 867.7251 876.1228 917.7642 948.3847 951.9807 957.2622 988.7909 1016.3719 1038.5516 1074.0538 1099.6046 1129.0434 1167.8910 1179.3844 1245.3253 1254.1369 1304.1588 1316.3399 1340.7977 1367.4255 1400.9949 1430.2879 1443.8219 1462.3449 1503.4110 1575.7875 1586.9783 1703.3861 3005.6402 3061.4866 3110.0578 3129.7216 3135.6618 3149.8537 3154.1491 3177.4940 3545.7258
redmass: 5.2387 10.1029 9.6259 5.4656 4.4138 4.7096 5.1519 5.1448 5.3154 4.3091 3.4001 3.4965 3.0968 2.7723 5.7470 5.7196 5.4432 1.4205 6.3122 4.2801 1.9624 2.0589 3.3283 4.4593 1.3589 2.7870 3.2536 1.4301 4.1339 1.3358 2.0035 2.3826 3.6994 1.5702 3.1520 1.0789 1.3201 1.1634 1.8460 1.1597 2.1567 5.2099 1.2620 1.7993 1.0892 1.0964 2.4368 2.2238 4.0790 5.9324 9.0412 1.0637 1.0588 1.1004 1.0887 1.0903 1.1087 1.0943 1.1009 1.0760
irintensity: 1.6715 1.6457 6.0138 2.0035 3.9073 2.9552 4.1960 2.5938 4.5567 0.6489 20.8278 3.8208 10.9779 15.9036 6.4421 13.9771 5.5979 27.3503 42.1860 46.1047 38.6717 94.8374 4.0206 14.9149 2.6914 24.7325 78.5211 1.5820 10.1400 0.3951 166.6165 10.6560 93.3033 3.6337 412.6225 1.8524 10.8199 3.1453 1.3851 28.7665 0.9496 63.3516 6.1048 13.2278 27.4829 23.9876 176.0243 490.7630 199.9453 125.9698 252.7758 24.8863 16.3290 5.6301 16.9084 5.6841 11.5675 20.5207 18.1713 39.1792
temp: 298.150 k
press: 1.00000 atm
elementType: 17 8 8 7 7 6 6 6 6 6 6 6 6 1 1 1 1 1 1 1 1 1
symmnumber: 1
zpe: 430662.0 jmol-1
zpe.correction: 0.164030 hartree
zpe.thermalcorrener: 0.176406 hartree
zpe.thermalcorrenthalpy: 0.177351 hartree
zpe.thermalcorrgfe: 0.121748 hartree
zpe.sumelectzpe: -1029.304540 hartree
zpe.sumelectthermal: -1029.292164 hartree
zpe.sumelectthermalent: -1029.291219 hartree
zpe.sumelectthermalfe: -1029.346822 hartree
dipole: -1.9304 1.5486 1.6277
dipole: 2.9621
quadrupole: -66.8613 -82.5253 -82.8089
quadrupole: -13.9855 4.7176 2.2958
quadrupole: 10.5372 -5.1268 -5.4104 -13.9855 4.7176 2.2958
hfenergy: -1029.46857 hartree
pointgroup: C01 [X(C8H9Cl1N2O2)]
dipole: -0.7460944 0.6203618 0.6454684 debye
dipolederiv: -0.2502677 -0.0830404 0.0613264 -0.1645561 -0.4399246 0.1736277 0.0855281 0.0921592 -0.265442 -1.9745029 -0.0798854 -0.0605095 -0.2625264 -0.449502 -0.1152763 -0.3648934 -0.073307 -0.4269026 -0.7495358 0.076144 0.0132738 0.298782 -0.8366336 -0.1644355 0.058227 -0.1982365 -0.3741888 -2.3080687 0.2547118 -0.0821587 0.6161118 -0.4169815 0.0312758 -0.0493235 -0.0002675 -0.3701179 -0.6429099 -0.0068144 -0.0566033 -0.4122695 -0.2970058 -0.073139 -0.1997867 -0.0213052 -0.2372285 0.9867763 -0.0451815 -0.0550256 -0.4294579 0.1064206 0.0510319 -0.0746753 0.0144057 0.2461415 1.9557451 0.0021488 0.2020807 0.1860748 0.1371211 -0.006729 0.3516014 -0.0158921 0.2017627 -0.631488 -0.0222072 -0.0515873 0.3242394 -0.02512 0.0884741 0.031008 0.0375634 -0.1607395 0.1381569 0.1280614 -0.0651712 0.3103026 0.5945796 -0.2017061 -0.0642876 -0.2201495 0.1431691 2.8114542 -0.1641163 0.1189128 -0.5929627 1.2595314 0.2828586 0.1701834 0.3494986 0.4524174 0.3225579 0.0071309 0.059889 0.0267055 0.1912511 0.0887667 0.0795088 0.0885816 -0.0721297 -0.1025659 0.1144506 0.0487259 -0.1184396 -0.3091119 -0.0577657 -0.0270522 -0.0295146 -0.1575316 0.2841261 -0.0819131 0.0321214 0.2173814 0.3554331 0.1527945 0.1176029 0.1168717 -0.0226099 0.0234671 -0.0626522 0.0603886 0.1113403 -0.0496593 0.0544375 0.0964547 0.0638267 0.0512226 -0.0636161 -0.0132615 -0.0538852 -0.0218635 0.0920228 -0.094838 -0.0572177 -0.0404166 0.0073402 0.2112867 0.0431342 -0.0075732 0.0309165 0.1762003 -0.041737 -0.0284692 -0.0379849 0.3148947 -0.0937595 0.0637338 0.031889 0.0443542 -0.0534134 0.0280266 0.0666404 0.0503573 0.094263 0.0716307 -0.0645754 -0.0820804 -0.0814044 -0.0198334 0.0079997 -0.0665433 0.0256117 0.0202436 0.0549679 -0.0773521 -0.0434635 -0.0703114 -0.0481486 -0.0755771 -0.0411625 -0.0753651 0.1459455 0.0118877 0.0927976 0.0079335 0.1082185 -0.0104858 -0.0319633 0.0093689 -0.0335162 0.1417785 -0.0982647 -0.0333009 -0.0516671 -0.0236435 0.0987817 -0.0270046 -0.0507884 -0.0293906 0.1604578 0.0429226 -0.0480126 -0.0268163 -0.0969919 -0.0555218 -0.0691212 -0.0419241 -0.0635299 0.107254 unknown
polarizability: 173.6745288|-0.9346739|113.8369076|6.7707578|8.8202045|64.7547198 unknown
InChI: InChI=1S/C8H9ClN2O2/c9-4-6-13-8(12)11-7-3-1-2-5-10-7/h1-3,5,11H,4,6H2
charge 0 multiplicity 1
22 atoms
Cl 4.549106 1.417637 -1.35495
O  2.236536 0.322014 0.679524
O  1.122116 -1.536596 -0.258797
N  0.019619 0.495917 0.375089
N  -1.77199 -0.919233 -0.331307
C  3.510013 -0.407073 0.536233
C  -1.353016 0.300876 0.095823
C  -2.234152 1.404925 0.285838
C  4.071924 -0.344594 -0.878772
C  1.087347 -0.379907 0.201842
C  -3.602761 1.219042 0.017194
C  -4.05689 -0.045481 -0.432318
C  -3.102346 -1.073537 -0.589223
H  3.351303 -1.471134 0.800131
H  4.184601 0.069946 1.263429
H  0.291935 1.409612 0.744843
H  5.00077 -0.931987 -0.950091
H  3.343831 -0.680646 -1.629871
H  -1.85544 2.374457 0.628652
H  -4.304344 2.04844 0.153711
H  -5.112195 -0.228376 -0.653284
H  -3.398268 -2.071004 -0.933696
