program: Gaussian 09
title: 000278452
version: EM64L-G09RevD.01
frameworkgroup: C1[X(C16H18O2)]
method: RPBEPBE
basis: SDD
operation: Freq
keyword: #pfreq=noraman
keyword: PBEPBE/SDD
title: #p freq=noraman PBEPBE/SDD
converged: YES YES NO NO
title: Mulliken charges:
elementType: O O C C C C C C C C C C C C C C C C H H H H H H H H H H H H H H H H H H
charge: -0.281575 -0.290876 -0.363882 -0.252848 0.209255 0.259413 0.310305 0.312263 -0.324893 -0.358195 -0.387330 -0.388271 -0.785899 -0.797066 -0.252573 -0.243048 -0.252528 -0.245347 0.225162 0.220559 0.204832 0.230923 0.267323 0.244314 0.230055 0.231956 0.211971 0.234726 0.237313 0.225531 0.254650 0.216444 0.223326 0.224312 0.223622 0.226076
chargesum: 0.00000
title: Mulliken charges with hydrogens summed into heavy atoms:
elementType: O O C C C C C C C C C C C C C C C C
charge: -0.281575 -0.290876 0.081839 0.182907 0.209255 0.259413 0.310305 0.312263 -0.057570 -0.113881 -0.157275 -0.156315 -0.101889 -0.100441 -0.029247 -0.018735 -0.028906 -0.019272
polarizability: 2.18844372e+02 -7.11586835e+00 1.97769801e+02 -1.28114823e+00 -5.68323469e+00 1.12725040e+02
1716.lowfreq: -4.7872 -0.0007 -0.0003 0.0007 0.9349 10.2410 21.8506 25.3203 45.0931
frequency: 21.7039 25.3183 45.0347 65.4547 105.5654 112.8859 127.2542 157.7971 171.8756 178.0677 186.3838 252.7033 269.4799 281.7879 297.8789 327.7358 418.2031 443.5081 446.4202 468.5829 485.9510 495.8277 529.0005 540.5844 542.9859 575.0802 600.4386 712.7403 717.2523 718.2230 742.5882 756.0094 757.4396 795.3223 801.4958 845.6053 851.6399 889.6483 911.3997 927.6728 928.5325 970.6152 972.5428 984.2363 984.9519 1025.8179 1041.3311 1045.6946 1047.2476 1049.8610 1050.7490 1103.7870 1116.3907 1118.0780 1170.6651 1172.2900 1182.1686 1191.0887 1218.5638 1229.6753 1234.7817 1282.4623 1288.4173 1289.9555 1368.0637 1370.7776 1382.4882 1390.0660 1399.6214 1400.7985 1428.8301 1430.1524 1455.9694 1456.3478 1459.1096 1460.0584 1476.0737 1478.6659 1487.8821 1490.1256 1594.8900 1597.6310 1607.9585 1609.7723 2948.9686 2977.7243 2981.8404 3001.3830 3024.7275 3055.3060 3059.8140 3068.6620 3089.3918 3089.4831 3120.8877 3123.6909 3131.4839 3134.7295 3155.5292 3157.6587 3169.3315 3179.5673
redmass: 4.1985 3.9080 4.4472 4.2694 1.2465 3.2639 2.9082 1.1387 3.2510 3.5175 3.1699 3.2335 3.9847 3.4017 3.2591 2.4908 3.2887 2.8826 3.0020 3.5523 4.4556 4.2086 3.8552 3.4920 3.5059 5.7269 5.8959 3.6417 2.6587 2.8283 4.0639 1.4657 1.4028 4.4780 4.4577 1.3563 1.3276 3.2453 2.8463 1.3888 1.3624 1.3074 1.3135 1.5962 1.5793 2.7613 2.6647 1.5581 1.5353 2.0867 2.1638 2.4706 1.9841 1.9391 1.2680 1.1350 1.7771 2.2225 1.1708 2.8224 2.5979 1.2302 1.4182 1.3579 1.2865 1.7399 5.2821 2.6853 1.3165 1.3487 1.9569 1.9996 1.1058 1.0786 1.0933 1.0471 1.2906 1.2389 2.0230 2.3348 6.5994 6.7464 6.3040 6.3141 1.0588 1.0369 1.0363 1.0623 1.0988 1.0967 1.0968 1.1056 1.0998 1.1000 1.0862 1.0864 1.0904 1.0893 1.0938 1.0974 1.0990 1.0946
irintensity: 0.0391 0.0731 0.4040 0.5835 0.1774 1.9156 2.3225 2.0553 1.2893 6.1420 3.6814 1.4925 0.8225 0.4969 0.8492 2.8796 7.5518 5.3122 4.0905 3.2062 4.7721 1.8359 4.0315 0.4177 0.3583 2.8663 7.5134 5.8335 11.2291 9.4874 15.3131 59.2917 127.3423 0.5693 1.3550 0.7466 5.5176 22.1137 54.8303 5.4953 4.1978 0.8106 0.1175 3.1713 3.5236 27.4856 29.7595 8.0073 7.8671 23.7651 2.0021 0.2438 99.3983 59.8488 35.3745 11.4330 88.0550 42.8334 2.3922 127.1654 59.4280 24.1163 0.8284 8.8429 11.0250 3.0348 3.6082 7.6977 16.7413 8.3537 26.0146 13.1593 10.1152 34.5669 17.6375 16.8476 10.7453 27.5194 93.8532 58.3880 14.8678 15.0042 33.1518 16.6002 43.2296 24.6657 33.5970 33.7501 46.3509 16.7983 20.4238 20.9679 29.9506 18.7094 4.8575 5.7722 24.3093 14.2917 35.9942 30.4206 14.6759 2.9657
temp: 298.150 k
press: 1.00000 atm
elementType: 8 8 6 6 6 6 6 6 6 6 6 6 6 6 6 6 6 6 1 1 1 1 1 1 1 1 1 1 1 1 1 1 1 1 1 1
symmnumber: 1
zpe: 778266.0 jmol-1
zpe.correction: 0.296426 hartree
zpe.thermalcorrener: 0.313666 hartree
zpe.thermalcorrenthalpy: 0.314611 hartree
zpe.thermalcorrgfe: 0.249749 hartree
zpe.sumelectzpe: -769.616556 hartree
zpe.sumelectthermal: -769.599316 hartree
zpe.sumelectthermalent: -769.598372 hartree
zpe.sumelectthermalfe: -769.663233 hartree
dipole: 0.8927 -1.3609 -0.9398
dipole: 1.8794
quadrupole: -104.7444 -94.1433 -108.0565
quadrupole: -1.6870 -0.5502 1.6339
quadrupole: -2.4296 8.1714 -5.7418 -1.6870 -0.5502 1.6339
hfenergy: -769.9129823 hartree
pointgroup: C01 [X(C16H18O2)]
dipole: 0.4106161 -0.6135305 0.0415067 debye
polarizability: 220.0600511|-7.9831424|149.9796458|-3.077126|-41.4655618|159.2995171 unknown
InChI: InChI=1S/C16H18O2/c1-13-7-3-5-9-15(13)17-11-12-18-16-10-6-4-8-14(16)2/h3-10H,11-12H2,1-2H3
charge 0 multiplicity 1
36 atoms
O  -1.446862 -1.372161 1.168423
O  1.188784 -0.639114 -0.381926
C  -0.465647 -2.214516 0.471882
C  0.968071 -1.705457 0.601761
C  -2.219769 -0.431844 0.447016
C  2.454367 -0.012632 -0.398271
C  -3.35702 0.060233 1.152349
C  2.589338 1.049398 -1.340013
C  -1.912807 0.011091 -0.859582
C  3.527975 -0.393072 0.441161
C  -4.180409 1.002306 0.493785
C  3.837089 1.708432 -1.410388
C  -3.655603 -0.423311 2.556801
C  1.421551 1.445498 -2.219856
C  -2.762255 0.948244 -1.491828
C  4.763524 0.288823 0.345477
C  -3.899452 1.446106 -0.820666
C  4.923484 1.340353 -0.580036
H  -0.52863 -3.189318 0.989233
H  -0.737969 -2.358355 -0.590707
H  1.670091 -2.544847 0.406384
H  1.138059 -1.326109 1.629228
H  -1.002019 -0.327833 -1.359075
H  3.419499 -1.206062 1.164711
H  -5.060256 1.388284 1.022862
H  3.955783 2.528298 -2.128868
H  -4.595851 0.014786 2.933167
H  -3.74029 -1.525028 2.589057
H  -2.840629 -0.154972 3.254339
H  1.090905 0.598875 -2.850902
H  0.548151 1.744364 -1.611419
H  1.692915 2.285856 -2.881147
H  -2.522233 1.293145 -2.504139
H  5.593439 -0.006538 0.996984
H  -4.556961 2.17393 -1.307932
H  5.878334 1.870948 -0.656366
