program: Gaussian 09
title: 000278445
version: EM64L-G09RevD.01
frameworkgroup: C1[X(C9H19N3O)]
method: RPBEPBE
basis: SDD
operation: Freq
keyword: #p
keyword: freq=noraman
keyword: PBEPBE/SDD
title: #p freq=noraman PBEPBE/SDD
converged: YES YES NO NO
title: Mulliken charges:
elementType: O N N N C C C C C C C C C H H H H H H H H H H H H H H H H H H H
charge: -0.254044 0.033550 -0.409613 -0.654038 -0.011738 -0.140749 -0.383797 -0.758885 0.116441 -0.756592 -0.720514 -0.813222 0.294293 0.177040 0.246212 0.190057 0.202680 0.213975 0.219581 0.219948 0.197953 0.233580 0.231908 0.262560 0.208428 0.213749 0.230802 0.233714 0.251837 0.285156 0.342649 0.297077
chargesum: 0.00000
title: Mulliken charges with hydrogens summed into heavy atoms:
elementType: O N N N C C C C C C C C C
charge: -0.254044 0.033550 -0.124457 -0.014312 0.165302 0.105464 0.008940 -0.105381 0.116441 -0.093150 -0.035777 -0.096869 0.294293
polarizability: 1.70083829e+02 9.38853423e+00 1.14811796e+02 3.61455118e+00 -9.73611639e+00 1.03614220e+02
1716.lowfreq: -19.3865 -0.0007 -0.0004 -0.0003 3.9599 5.2512 13.5617 35.1602 58.5034
frequency: 12.0169 34.7342 57.8005 100.0346 103.9494 114.9632 120.8710 165.6177 202.8912 213.8143 227.0511 245.2264 250.4679 253.0736 283.6896 285.6254 327.1178 363.5582 407.9197 421.9532 477.6873 506.0365 508.1377 537.2940 585.9387 586.9613 646.8308 711.3316 757.1830 782.6445 798.2301 882.0867 931.2055 951.0990 966.7989 981.7821 992.9615 1013.9302 1021.7677 1028.5078 1047.1033 1070.7875 1106.3618 1134.5789 1148.5216 1169.3677 1252.4573 1271.5436 1274.6114 1288.0895 1296.9249 1314.2568 1335.9939 1348.1317 1380.9146 1386.4411 1394.2837 1399.0102 1450.3561 1464.4747 1470.0308 1475.4759 1476.8657 1481.5969 1488.8482 1493.4613 1498.0689 1502.5691 1596.6733 1603.2844 1681.0196 2932.5991 2951.3015 2967.4530 2972.9335 2977.4177 2982.7579 3011.9116 3016.2892 3019.9906 3066.2074 3067.8838 3071.8189 3077.6176 3082.5047 3087.1168 3101.5046 3417.6761 3537.6894 3696.6632
redmass: 4.4979 3.4800 2.9772 3.9368 2.0289 1.6498 3.2463 1.6431 1.1706 1.5357 1.4245 1.3299 1.6642 2.8022 2.1222 3.4865 2.2842 2.2270 2.7429 2.4639 1.2777 1.6128 2.4022 2.5135 3.3789 2.8806 3.5551 8.4711 2.0620 1.3415 2.6417 1.9262 2.7416 1.4874 1.5509 1.5048 1.7207 1.6090 1.3549 1.9786 2.4550 2.4379 2.7850 2.1992 2.3905 1.9845 1.4309 1.4348 1.8282 1.9054 1.8570 1.5254 1.4569 1.3669 1.2365 1.2089 1.1980 1.2043 1.2004 1.0707 1.0499 1.0557 1.0545 1.0513 1.0505 1.0517 1.1897 1.2786 4.1360 1.4277 5.4286 1.0794 1.0405 1.0609 1.0379 1.0365 1.0374 1.1001 1.0846 1.0974 1.0988 1.0981 1.0987 1.0991 1.1007 1.0983 1.0938 1.0748 1.0459 1.1034
irintensity: 16.5777 2.7869 0.5642 5.9288 0.1791 2.4676 2.7265 0.1224 0.0921 0.3776 0.0139 10.0856 1.9369 0.5054 2.9828 2.8066 1.1914 11.2235 3.4490 96.9892 247.9106 9.5489 11.4358 7.4247 15.6628 24.2678 9.8117 17.6075 0.8988 12.1721 1.1610 0.9382 1.2035 1.5052 12.4724 1.2909 8.6352 3.4849 4.0181 32.9597 15.4895 11.2142 114.3840 18.1101 25.6154 7.7804 15.5588 29.9672 44.7063 93.2468 188.4843 11.4937 0.7990 0.7714 21.4821 20.1680 20.3520 23.3179 173.1508 3.7671 7.0161 32.9155 13.0953 20.2208 7.5396 9.5655 71.0733 130.2212 46.7831 91.3255 301.3802 26.4128 16.6681 64.1818 31.8230 30.4686 23.7698 42.6962 19.4276 16.7812 10.9832 50.2024 72.2777 25.8256 53.1112 28.8632 15.8362 16.1455 41.3541 40.5874
temp: 298.150 k
press: 1.00000 atm
elementType: 8 7 7 7 6 6 6 6 6 6 6 6 6 1 1 1 1 1 1 1 1 1 1 1 1 1 1 1 1 1 1 1
symmnumber: 1
zpe: 724950.3 jmol-1
zpe.correction: 0.276119 hartree
zpe.thermalcorrener: 0.292725 hartree
zpe.thermalcorrenthalpy: 0.293669 hartree
zpe.thermalcorrgfe: 0.231026 hartree
zpe.sumelectzpe: -592.764276 hartree
zpe.sumelectthermal: -592.747671 hartree
zpe.sumelectthermalent: -592.746726 hartree
zpe.sumelectthermalfe: -592.809370 hartree
dipole: 0.1299 -4.0777 4.5511
dipole: 6.1121
quadrupole: -67.4801 -82.1729 -82.8762
quadrupole: -8.9841 12.9495 -0.0081
quadrupole: 10.0297 -4.6632 -5.3665 -8.9841 12.9495 -0.0081
hfenergy: -593.0403953 hartree
pointgroup: C01 [X(C9H19N3O1)]
dipole: 0.0362356 -1.5351847 1.8504932 debye
polarizability: 169.4156485|10.9873281|114.5147736|5.184714|-9.7675661|104.5794229 unknown
InChI: InChI=1S/C9H19N3O/c1-5-6(2)7(3)8(4)11-12-9(10)13/h6-7,12H,5,10H2,1-4H3
charge 0 multiplicity 1
32 atoms
O  3.184452 1.221144 -1.120669
N  0.8646 -0.166798 -0.310236
N  2.095308 -0.310542 0.32345
N  4.387488 0.107991 0.538166
C  -2.585547 0.033233 0.331872
C  -1.486674 -0.639422 -0.561712
C  -2.083261 1.347706 1.001824
C  -3.893816 0.275169 -0.462657
C  -0.169789 -0.815916 0.186812
C  -1.952842 -1.997908 -1.152816
C  -1.651925 2.465385 0.024159
C  -0.108162 -1.711256 1.417326
C  3.214542 0.403392 -0.167268
H  -2.828435 -0.675392 1.155956
H  -1.263556 0.041622 -1.404984
H  -2.892888 1.726246 1.659298
H  -1.227635 1.112735 1.666942
H  -4.614711 0.848807 0.149521
H  -3.704138 0.852161 -1.386769
H  -4.38319 -0.671639 -0.751313
H  -2.250265 -2.711025 -0.359263
H  -2.820232 -1.860606 -1.821284
H  -1.143355 -2.460647 -1.745554
H  -0.770808 2.162195 -0.568636
H  -1.377621 3.38025 0.581112
H  -2.466042 2.73422 -0.673524
H  0.252386 -1.157824 2.309114
H  0.569027 -2.576419 1.262236
H  -1.102868 -2.113975 1.662509
H  2.20119 -0.911736 1.150497
H  5.226417 0.601685 0.2451
H  4.459446 -0.595838 1.269989
