program: Gaussian 09
title: 000278603
version: EM64L-G09RevD.01
frameworkgroup: C1[X(C22H23NO7S)]
method: RPBEPBE
basis: SDD
operation: Freq
keyword: #p
keyword: freq=noraman
keyword: PBEPBE/SDD
title: #p freq=noraman PBEPBE/SDD
converged: YES YES NO NO
title: Mulliken charges:
elementType: S O O O O O O O N C C C C C C C C C C C C C C C C C C C C C C H H H H H H H H H H H H H H H H H H H H H H H
charge: 0.975343 -0.422478 -0.286741 -0.505928 -0.505762 -0.243012 -0.197050 -0.223506 0.029356 -0.023678 -0.101473 -0.519564 -0.472169 -0.371987 -0.395562 -0.197232 -0.213788 0.204630 -0.036580 0.242294 -0.259431 -0.230360 -0.334355 -0.390630 0.454620 -0.330480 -0.329152 -0.356547 -0.339725 -0.816863 0.380728 0.259719 0.236701 0.263076 0.210210 0.224392 0.214181 0.240409 0.248450 0.232451 0.255270 0.208545 0.206445 0.288467 0.279863 0.255570 0.249236 0.280986 0.337927 0.289619 0.292072 0.284527 0.224415 0.234551
chargesum: 0.00000
title: Mulliken charges with hydrogens summed into heavy atoms:
elementType: S O O O O O O O N C C C C C C C C C C C C C C C C C C C C C C
charge: 0.975343 -0.422478 -0.286741 -0.505928 -0.505762 -0.243012 -0.197050 -0.223506 0.029356 0.236041 0.135227 -0.046278 -0.033596 0.116872 0.092160 0.011313 -0.007343 0.204630 -0.036580 0.242294 0.029036 0.049502 -0.078785 -0.141394 0.454620 -0.049494 0.008774 -0.066928 -0.047654 -0.073370 0.380728
polarizability: 3.94576572e+02 -1.41069858e+00 2.94213107e+02 1.40756191e+01 9.02884009e+00 2.07004878e+02
1716.lowfreq: -9.9157 -4.5724 0.0013 0.0013 0.0021 2.2653 6.0339 16.2606 21.4776
frequency: -8.9389 16.0806 21.2267 33.0171 36.6886 40.0699 44.6794 54.6544 67.4807 77.5837 80.7786 89.9637 101.1554 106.1357 125.5782 132.2204 137.3348 150.0612 185.8201 210.2094 223.2435 231.1985 252.9259 262.6549 275.2574 284.4162 303.8938 312.6952 336.1337 351.0158 355.0812 383.8410 385.9196 407.1899 412.0948 414.7401 438.3128 453.5019 460.1858 464.8343 483.3671 488.7866 509.3304 517.6273 529.8521 593.2501 598.6872 620.1229 623.1979 651.7666 672.5291 680.6100 685.7870 704.0557 754.3244 764.7293 765.5565 777.3954 784.2252 807.7386 825.8167 832.2788 847.6922 870.4543 871.2997 879.7993 891.5376 893.4458 898.7450 926.5943 952.7778 955.6032 963.3547 974.0256 983.8192 989.5114 999.3564 1003.9756 1008.4059 1020.0713 1028.2907 1033.8644 1052.7411 1056.6999 1065.4725 1072.1730 1085.5013 1090.5928 1111.0681 1114.6268 1120.5259 1122.0070 1156.7633 1185.8288 1186.5908 1192.4516 1210.9494 1215.7895 1220.1224 1228.8504 1235.2100 1238.7056 1269.6095 1297.7478 1299.0388 1301.8792 1304.8582 1323.0281 1336.2059 1343.6820 1358.4273 1362.5647 1363.4273 1377.2334 1380.5180 1392.1192 1405.2663 1406.2515 1414.3241 1454.7488 1455.4427 1464.9718 1470.9362 1471.7492 1477.6329 1481.0744 1485.2024 1589.8358 1590.1771 1593.1903 1608.1297 1625.6775 1678.8729 2939.9208 2947.1559 2963.8499 2980.2833 2985.5647 3001.8701 3005.3682 3012.8216 3020.4840 3067.9620 3069.1390 3076.3763 3094.0288 3099.1419 3130.7497 3142.5167 3143.5989 3154.2435 3163.3074 3164.3329 3167.8729 3187.0403 3189.2521
redmass: 6.5984 6.5321 7.9421 5.7125 7.3558 4.8772 9.4779 5.8560 5.0428 6.4147 5.0352 3.8910 6.5178 1.1504 3.7508 4.3170 5.2354 4.8290 5.0927 4.3579 7.3167 7.2465 5.4626 6.8291 7.1715 6.1204 4.5382 4.6759 2.7682 2.2015 7.0463 3.7673 2.2600 2.8764 2.9328 4.7724 3.6514 5.0697 4.3031 5.7567 5.9720 6.0892 3.5909 6.0783 5.8310 5.5566 4.3881 6.9640 7.0892 6.2661 1.4044 4.3753 4.1172 3.3812 3.7375 4.9933 5.1842 4.9249 3.5269 4.2217 1.5003 6.3737 1.2499 1.9278 1.6154 2.7190 4.6784 3.2946 1.5551 1.7813 13.9383 2.2724 1.3021 1.2037 1.3770 3.0536 1.8125 3.3969 1.3489 1.7529 2.5431 1.3278 2.4576 1.5856 3.9773 2.7763 3.8989 3.0589 1.9474 1.3504 1.3135 1.7447 1.3149 1.2684 1.1966 1.1797 1.4310 3.0068 3.0983 1.1667 1.1543 3.9922 1.3251 1.2608 1.2625 1.2413 1.2576 1.3932 1.4290 1.5008 1.4524 7.8889 1.3903 1.6362 4.7865 3.0027 3.9027 1.6211 3.7977 1.0825 1.0919 1.0873 1.0964 2.1351 2.2214 1.1008 1.1115 8.1418 6.3129 6.3719 6.2670 10.2510 6.4163 1.0659 1.0648 1.0798 1.0665 1.0372 1.0908 1.0895 1.0637 1.0869 1.0973 1.0974 1.1073 1.0995 1.0840 1.0996 1.0889 1.0891 1.0936 1.0902 1.0961 1.0973 1.0948 1.0958
irintensity: 0.4862 2.2257 0.0746 0.0394 0.1074 0.3796 0.0884 0.9218 2.4097 1.0617 1.6552 0.5891 1.6463 0.9695 0.8313 3.1723 1.8181 3.0550 3.7391 0.9147 13.7646 10.9374 3.0161 1.4157 1.7119 6.4497 9.5252 3.2445 5.4397 5.6162 4.9027 1.6764 0.3043 0.0524 0.0096 9.9120 3.6963 13.6316 2.2255 28.7098 2.4776 13.6321 20.7771 4.0824 163.3993 31.1041 22.4265 0.3791 0.0209 0.9242 42.2574 23.2617 43.4296 0.4707 8.3577 9.7612 3.5334 3.5023 11.3210 7.0703 90.6767 56.8659 2.6516 13.5574 4.2511 0.9252 50.4898 39.5811 31.8530 11.7259 77.3331 2.6027 1.4063 0.1044 0.1498 1.9104 3.8845 27.4333 0.0335 13.3329 1.8966 1.0645 19.4483 22.1993 225.0286 21.8287 84.0554 4.3207 16.9896 12.7434 9.5118 6.5260 6.6115 24.4280 0.5937 13.6447 98.8172 338.0652 31.8480 3.9403 0.6491 100.5432 11.1697 1.8549 2.7024 2.0173 2.3919 0.9833 24.9126 0.2379 3.8781 114.0874 8.2584 0.0184 4.1253 11.4885 6.7902 23.3135 87.3671 21.5841 1.9735 7.4495 9.6310 18.3135 7.9570 16.9238 28.6895 35.9014 15.5421 4.0356 9.8901 173.7266 4.8115 25.9067 25.4586 16.3263 13.8639 18.0498 10.6598 12.8203 29.4101 61.4398 7.6709 9.5034 18.8712 16.8670 5.5800 69.3405 10.2689 2.4599 21.2968 1.4812 0.7755 7.1820 6.0819 7.3054
temp: 298.150 k
press: 1.00000 atm
elementType: 16 8 8 8 8 8 8 8 7 6 6 6 6 6 6 6 6 6 6 6 6 6 6 6 6 6 6 6 6 6 6 1 1 1 1 1 1 1 1 1 1 1 1 1 1 1 1 1 1 1 1 1 1 1
symmnumber: 1
zpe: 1079252.4 jmol-1
zpe.correction: 0.411066 hartree
zpe.thermalcorrener: 0.440249 hartree
zpe.thermalcorrenthalpy: 0.441194 hartree
zpe.thermalcorrgfe: 0.348237 hartree
zpe.sumelectzpe: -1828.988038 hartree
zpe.sumelectthermal: -1828.958854 hartree
zpe.sumelectthermalent: -1828.957910 hartree
zpe.sumelectthermalfe: -1829.050866 hartree
dipole: -0.1226 0.5107 -1.7304
dipole: 1.8083
quadrupole: -185.4844 -210.6617 -184.4831
quadrupole: -20.8150 -1.3775 1.7107
quadrupole: 8.0587 -17.1186 9.0599 -20.8150 -1.3775 1.7107
hfenergy: -1829.3991034 hartree
pointgroup: C01 [X(C22H23N1O7S1)]
dipole: 0.0583946 0.1724689 -0.6877546 debye
polarizability: 393.6450467|-9.1621528|279.3405968|-11.457953|36.0863255|222.8089134 unknown
InChI: InChI=1S/C22H23NO7S/c1-16-6-12-21(13-7-16)31(27,28)30-15-19-5-3-2-4-18(19)14-29-22(24)17-8-10-20(11-9-17)23(25)26/h2-3,6-13,18-19H,4-5,14-15H2,1H3
charge 0 multiplicity 1
54 atoms
S  1.216047 2.600631 1.404875
O  1.382486 1.426338 -0.050229
O  1.836468 -1.278073 -1.926499
O  1.881886 4.010358 0.961233
O  1.708909 1.874323 2.768984
O  1.473567 -3.315168 -3.019066
O  -5.298531 -2.611305 -1.0673
O  -4.762395 -0.684194 0.023828
N  -4.451199 -1.71303 -0.696325
C  3.397745 -0.058567 0.051791
C  4.104424 -0.992984 -0.984722
C  4.363525 0.260864 1.221674
C  4.452297 -2.340304 -0.295859
C  2.774539 1.225672 -0.544055
C  3.286773 -1.236433 -2.271844
C  5.072315 -0.974623 1.739797
C  5.091319 -2.15503 1.067625
C  1.04876 -2.340905 -2.353033
C  -0.651219 2.652841 1.346336
C  -0.370796 -2.151223 -1.907201
C  -1.357731 1.772851 2.183551
C  -1.266371 3.548796 0.459068
C  -2.766214 1.790772 2.107087
C  -2.678768 3.546786 0.407302
C  -3.446563 2.665151 1.214513
C  -1.326711 -3.132501 -2.278737
C  -0.759303 -1.0246 -1.134125
C  -2.670798 -2.996625 -1.886289
C  -2.101174 -0.879425 -0.735643
C  -4.958474 2.633598 1.121123
C  -3.034979 -1.867226 -1.117918
H  2.548786 -0.640755 0.459291
H  5.0563 -0.513174 -1.299588
H  3.790991 0.734984 2.043946
H  5.114314 1.015772 0.899291
H  3.530496 -2.954795 -0.202146
H  5.134477 -2.920969 -0.94953
H  3.372598 2.13437 -0.327194
H  2.630499 1.170056 -1.636005
H  3.389753 -0.410178 -2.99715
H  3.563368 -2.185785 -2.765343
H  5.574246 -0.893486 2.713502
H  5.59266 -3.027763 1.507697
H  -0.825108 1.107851 2.870752
H  -0.669703 4.225988 -0.159937
H  -3.346849 1.111367 2.74065
H  -3.188941 4.233285 -0.277119
H  -0.996305 -3.98988 -2.8733
H  -0.017057 -0.271758 -0.850582
H  -3.4301 -3.734189 -2.157714
H  -2.42817 -0.024446 -0.139241
H  -5.298331 1.658018 0.726335
H  -5.34409 3.425665 0.457709
H  -5.424964 2.762959 2.114836
