program: Gaussian 09
title: 000278476
version: EM64L-G09RevD.01
frameworkgroup: C1[X(C14H22O3)]
method: RPBEPBE
basis: SDD
operation: Freq
keyword: #pfreq=noraman
keyword: PBEPBE/SDD
title: #p freq=noraman PBEPBE/SDD
converged: NO YES NO NO
title: Mulliken charges:
elementType: O O O C C C C C C C C C C C C C C H H H H H H H H H H H H H H H H H H H H H H
charge: -0.244187 -0.269280 -0.215118 -0.547105 -0.450174 0.462497 -0.280697 -0.291472 -0.843878 0.386610 -0.401656 -0.805634 -0.804424 -0.579931 0.302911 0.243091 -0.757106 0.198447 0.214249 0.201789 0.210034 0.200689 0.227734 0.228625 0.224653 0.272112 0.223088 0.239945 0.244433 0.215117 0.218791 0.206712 0.215960 0.266591 0.279266 0.240368 0.248326 0.287514 0.231108
chargesum: 0.00000
title: Mulliken charges with hydrogens summed into heavy atoms:
elementType: O O O C C C C C C C C C C C C C C
charge: -0.244187 -0.269280 -0.215118 -0.134409 -0.038351 0.462497 -0.080008 -0.063738 -0.118488 0.386610 0.061377 -0.127293 -0.115160 -0.060296 0.302911 0.243091 0.009842
polarizability: 1.77557537e+02 -1.25835574e+01 1.59853678e+02 1.30063832e+00 2.25954371e+00 1.46748723e+02
1716.lowfreq: -8.7574 -7.9430 -4.4734 -0.0005 -0.0002 0.0005 19.2069 23.7671 33.8740
frequency: 19.0352 23.4392 33.8428 42.9912 54.3655 63.0951 74.8930 87.5953 122.3305 123.0968 134.3229 156.0750 157.9486 183.3105 199.1800 233.2774 243.7082 277.8924 288.2315 334.5663 352.7082 363.8812 389.0303 405.3077 443.5507 464.9957 478.1538 495.7133 519.2198 524.8581 563.5948 592.4633 688.4644 739.0314 759.8840 783.4648 808.2646 826.2328 857.0241 874.4499 892.1488 905.9364 923.0362 951.6392 973.6375 994.4758 996.6676 1005.3050 1011.8208 1032.4216 1042.4725 1049.9731 1087.9476 1096.9198 1106.5839 1129.4578 1154.5953 1174.8570 1200.2552 1210.8003 1228.8404 1230.4225 1248.6922 1278.2135 1300.4476 1324.0190 1331.4908 1359.4842 1371.5925 1372.2574 1390.0462 1397.9391 1402.2067 1431.1756 1446.3724 1450.8960 1453.0025 1454.0301 1458.5975 1461.7594 1469.7442 1471.1441 1474.1043 1484.5353 1496.9602 1611.3936 1639.5677 1675.7489 1696.3806 2952.8240 2958.3706 2964.1606 2967.8309 2973.4742 2978.0335 3010.4030 3026.1758 3034.4542 3037.4051 3041.0560 3044.0604 3044.5602 3061.2480 3063.3443 3077.4176 3086.8529 3097.6563 3103.9468 3122.3856 3124.4361 3126.7476
redmass: 4.5139 3.7794 4.1551 3.5308 3.6840 3.5620 4.7024 4.3623 1.0844 1.5290 2.1238 1.2222 2.0898 3.3579 1.3533 3.3829 2.7819 2.5906 2.7962 2.6046 2.5654 2.3969 2.2293 2.3671 2.8402 2.2978 3.8060 2.8217 2.8259 3.1219 2.3453 3.6201 4.4719 2.2591 4.7187 2.6416 3.8639 1.4240 1.8477 2.2983 1.8239 2.6382 1.9185 1.3861 1.8435 1.8414 1.4087 1.8823 1.9407 1.8651 1.5358 1.7759 1.6586 2.0737 1.7892 2.4626 1.5813 1.8388 1.3212 1.4264 2.3927 2.0561 1.3635 1.5162 1.3747 1.3860 1.3500 1.4586 1.4129 1.2814 1.3061 1.2637 1.2149 1.0871 1.0628 1.0767 1.0640 1.0684 1.1062 1.0744 1.0562 1.0894 1.0575 1.0775 1.0695 8.0218 7.5326 6.5491 6.4215 1.0650 1.0373 1.0386 1.0420 1.0594 1.0373 1.0635 1.0971 1.0958 1.0954 1.0955 1.0848 1.0663 1.0956 1.0908 1.0983 1.0971 1.0985 1.0953 1.0979 1.1024 1.1006
irintensity: 0.9294 1.8432 0.5782 0.1198 3.1464 0.1734 2.7256 7.3201 0.0116 1.1122 0.4281 0.1383 0.2400 0.5841 3.9990 6.8288 5.9530 2.1707 2.1722 3.4885 6.0936 2.2926 0.0238 2.1981 12.6798 5.2660 4.0447 5.0516 1.1770 13.1648 11.9878 9.5098 5.9602 5.5724 38.1367 0.2129 2.4718 11.8004 15.1697 42.7380 20.5019 46.0909 7.0406 0.6191 5.9133 2.3458 3.9092 0.8059 5.9454 2.4921 3.8228 15.5762 7.2477 174.9113 20.5444 5.0646 2.1352 148.0919 8.9406 19.6260 83.7592 11.5747 6.4082 91.4267 0.3988 1.4055 15.0321 1.1279 10.8895 82.5194 25.9002 35.8164 10.7995 20.0508 34.4110 3.9751 13.0745 15.0369 22.8278 10.2734 12.9274 15.7543 16.6868 7.9050 11.7689 175.4480 101.6913 38.2826 6.0356 25.3079 36.2957 42.6792 14.1781 92.1964 6.9126 4.0940 8.6687 6.1990 36.5788 23.4058 45.2567 12.7946 5.4871 27.9627 41.3737 32.2501 6.4967 7.4995 2.5220 18.8988 7.4880
temp: 298.150 k
press: 1.00000 atm
elementType: 8 8 8 6 6 6 6 6 6 6 6 6 6 6 6 6 6 1 1 1 1 1 1 1 1 1 1 1 1 1 1 1 1 1 1 1 1 1 1
symmnumber: 1
zpe: 861504.8 jmol-1
zpe.correction: 0.328130 hartree
zpe.thermalcorrener: 0.348992 hartree
zpe.thermalcorrenthalpy: 0.349936 hartree
zpe.thermalcorrgfe: 0.275875 hartree
zpe.sumelectzpe: -770.994545 hartree
zpe.sumelectthermal: -770.973683 hartree
zpe.sumelectthermalent: -770.972739 hartree
zpe.sumelectthermalfe: -771.046800 hartree
dipole: -0.1241 -2.0824 0.4788
dipole: 2.1404
quadrupole: -91.5075 -106.9932 -102.6995
quadrupole: 1.6146 -0.4949 4.7659
quadrupole: 8.8926 -6.5931 -2.2995 1.6146 -0.4949 4.7659
hfenergy: -771.3226746 hartree
pointgroup: C01 [X(C14H22O3)]
dipole: 0.0663726 -0.8063897 0.2333367 debye
polarizability: 180.7155281|-9.5333842|156.9083305|1.7265149|1.7985886|146.5360792 unknown
InChI: InChI=1S/C14H22O3/c1-11(2)6-5-7-12(3)8-9-17-14(16)10-13(4)15/h6,8H,5,7,9-10H2,1-4H3
charge 0 multiplicity 1
39 atoms
O  -0.68197 -2.102616 -1.357108
O  -1.295354 -1.962896 0.893183
O  -2.879118 1.367804 -0.654395
C  3.454645 -0.122142 -0.029727
C  2.989448 1.336877 0.295766
C  2.358524 -1.167467 0.13607
C  2.035432 1.899323 -0.738756
C  1.743254 -1.692906 -0.96611
C  2.03377 -1.555575 1.56791
C  0.844963 2.535278 -0.538226
C  0.658304 -2.730235 -0.969327
C  0.220851 2.798581 0.821752
C  0.025368 3.049594 -1.711536
C  -2.777571 -1.05382 -0.871863
C  -1.525522 -1.742948 -0.322663
C  -3.088828 0.252718 -0.110487
C  -3.635211 0.109593 1.296016
H  4.301021 -0.372537 0.642836
H  3.844579 -0.141519 -1.065612
H  2.54862 1.372171 1.308961
H  3.90312 1.967869 0.335506
H  2.37479 1.779829 -1.781023
H  2.051546 -1.331053 -1.956276
H  2.799522 -2.252598 1.963411
H  2.054282 -0.662507 2.220142
H  1.04099 -2.02087 1.673985
H  0.80011 -3.473404 -1.770393
H  0.527202 -3.231262 0.002842
H  -0.827768 2.44377 0.832786
H  0.762083 2.316593 1.652869
H  0.185977 3.887489 1.028037
H  -0.132182 4.144565 -1.634934
H  0.516703 2.841176 -2.678315
H  -0.979081 2.583713 -1.717017
H  -2.636368 -0.834842 -1.940106
H  -3.624108 -1.756005 -0.745813
H  -3.727907 1.094659 1.777684
H  -2.968329 -0.552319 1.879638
H  -4.628082 -0.379984 1.268088
