program: Gaussian 09
title: 000278416
version: EM64L-G09RevD.01
frameworkgroup: C1[X(C10H13NO)]
method: RPBEPBE
basis: SDD
operation: Freq
keyword: #p
keyword: freq=noraman
keyword: PBEPBE/SDD
title: #p freq=noraman PBEPBE/SDD
converged: YES YES NO NO
title: Mulliken charges:
elementType: O N C C C C C C C C C C H H H H H H H H H H H H H
charge: -0.263139 -0.201150 0.101962 0.385356 0.385380 -0.431907 -0.431882 -0.221772 -0.804529 -0.804672 -0.648567 -0.119329 0.236658 0.236650 0.229173 0.247960 0.240455 0.226309 0.240426 0.247969 0.226339 0.252622 0.227079 0.252209 0.190400
chargesum: 0.00000
title: Mulliken charges with hydrogens summed into heavy atoms:
elementType: O N C C C C C C C C C C
charge: -0.263139 -0.201150 0.101962 0.385356 0.385380 -0.195249 -0.195233 0.007401 -0.089803 -0.089938 0.083343 0.071071
polarizability: 1.45717737e+02 -8.04289291e-03 1.20876219e+02 9.88264340e-01 9.79281171e-03 7.53414558e+01
1716.lowfreq: -69.5052 -15.3223 -0.0007 -0.0003 -0.0003 6.0452 9.1914 25.3251 85.6488
frequency: -69.3154 20.5599 85.6477 91.0908 103.9680 107.3579 163.8568 223.8307 236.8500 283.6562 288.8357 364.0680 382.8606 392.8902 484.1004 519.6076 547.4422 568.3834 572.6541 726.9822 759.6277 783.3356 805.1017 900.7539 915.8077 961.4739 966.3996 983.2846 986.7161 1039.1875 1043.8940 1045.3769 1086.4593 1109.2781 1119.6607 1179.2190 1248.7503 1257.7569 1277.8808 1313.9245 1363.7110 1370.0065 1401.6964 1403.1082 1425.6655 1443.3889 1452.1322 1456.2977 1465.7221 1467.9090 1480.5952 1485.3714 1487.5306 1598.2127 1599.0530 1620.4324 2938.0837 2982.9072 2983.5857 2986.3668 3059.8178 3060.2299 3065.8380 3091.2808 3091.7338 3117.9659 3123.4131 3133.6807 3157.5344
redmass: 1.2201 2.3839 2.8156 2.5818 1.1672 1.1977 3.4089 2.8503 3.0678 3.1879 3.1575 3.4603 2.6861 5.3451 3.7017 3.0206 5.2045 3.4673 4.7339 5.2556 4.3351 1.2049 4.2730 1.3079 2.5763 1.5805 3.2559 1.3473 1.6761 1.8040 1.5770 1.5405 1.7810 1.2999 1.6865 1.1640 4.9275 1.5996 3.3714 3.2141 7.6243 1.4226 1.2383 1.2361 1.3350 1.6227 1.7762 1.0613 1.0485 1.0476 1.2888 1.4784 1.0896 5.6151 7.8047 5.8108 1.0870 1.0374 1.0374 1.0340 1.0972 1.0970 1.1009 1.0992 1.0991 1.1013 1.0858 1.0920 1.0994
irintensity: 0.0049 1.6644 2.0945 0.6129 0.5428 0.1240 0.6733 0.0319 5.6124 9.1213 3.1351 10.4388 19.5895 2.4216 3.7448 0.0042 0.2944 6.1814 1.5535 4.8918 0.0557 53.2345 9.1317 0.0010 4.3372 0.8769 8.7706 0.1625 5.3178 0.3558 19.5222 0.0517 48.1569 0.0135 10.3840 1.7741 8.2068 0.0165 13.3895 92.5098 4.5866 19.2891 23.6203 4.0559 8.5378 7.5051 0.9389 4.4854 36.6091 1.8331 25.4993 52.1990 0.1014 46.9528 6.8022 323.2043 65.7785 34.6605 8.3035 29.0913 1.6040 31.1511 21.3977 18.7225 25.6116 14.0854 0.0165 23.1392 30.0878
temp: 298.150 k
press: 1.00000 atm
elementType: 8 7 6 6 6 6 6 6 6 6 6 6 1 1 1 1 1 1 1 1 1 1 1 1 1
symmnumber: 1
zpe: 539885.5 jmol-1
zpe.correction: 0.205632 hartree
zpe.thermalcorrener: 0.217778 hartree
zpe.thermalcorrenthalpy: 0.218722 hartree
zpe.thermalcorrgfe: 0.166367 hartree
zpe.sumelectzpe: -517.953151 hartree
zpe.sumelectthermal: -517.941005 hartree
zpe.sumelectthermalent: -517.940061 hartree
zpe.sumelectthermalfe: -517.992416 hartree
dipole: -3.9750 0.0078 1.6741
dipole: 4.3132
quadrupole: -84.9977 -64.1364 -72.2503
quadrupole: 0.0285 7.2047 0.0021
quadrupole: -11.2029 9.6584 1.5445 0.0285 7.2047 0.0021
hfenergy: -518.1587827 hartree
pointgroup: C01 [X(C10H13N1O1)]
dipole: -1.5774694 -0.0030034 -0.6254215 debye
dipolederiv: -1.3226462 -0.0020106 -0.3552092 -0.0011116 -0.3550657 -0.0006961 -0.0444527 -0.0004726 -0.4792802 -0.9156363 -0.0010747 -0.2148838 -0.0010633 -0.3179568 -0.0016182 -0.4715304 -0.0027225 -0.7130046 0.6836057 0.0003707 -0.0335048 -0.000376 -0.0295701 -0.0008472 -0.1425126 -0.0004621 -0.1542655 0.0183974 0.2082566 -0.0220062 0.1191119 0.2195367 -0.0228322 0.018339 -0.0245978 0.0021491 0.0180854 -0.2083448 -0.0225916 -0.1193478 0.2191977 0.0236322 0.0157674 0.0256935 0.0025607 -0.1200389 -0.203945 -0.0091296 -0.0666834 -0.0665708 0.017936 -0.0071647 0.0268334 -0.1836883 -0.120167 0.20392 -0.0086966 0.0666835 -0.0664196 -0.0176604 -0.0075234 -0.02654 -0.1838977 0.1311976 0.0000023 -0.027778 0.0000222 0.079798 0.0002192 -0.0292303 0.0002572 -0.1210773 -0.0178054 -0.1691863 0.0040962 -0.0956868 -0.0566207 0.0038294 0.0007044 0.0217395 0.0458361 -0.018154 0.1687944 0.0044489 0.0956834 -0.056469 -0.004215 0.0010002 -0.0230432 0.0459748 0.1213791 -0.0010025 -0.077812 -0.0039681 0.2197687 0.0009523 -0.1673938 0.0012388 0.3389957 1.5927894 0.0026166 0.5012033 0.0054181 0.1178981 0.0035625 0.7037728 0.0034499 0.8853753 0.0267751 0.0659685 0.0091693 0.1015044 -0.0816881 -0.0101288 0.0127034 -0.0089451 0.1534397 0.0268465 -0.0659822 0.0089708 -0.1015078 -0.0818069 0.0096636 0.0127011 0.0083919 0.1534608 -0.133774 -0.0000695 0.0292856 -0.000058 0.0823495 -0.000069 0.0310869 -0.0000905 0.1510096 -0.0025862 -0.0514939 -0.102005 -0.0298402 0.0536364 0.0277463 -0.1149776 -0.0303022 -0.0051936 0.0396742 -0.0469979 0.0982852 -0.0407378 0.047272 -0.0186324 0.108566 0.0445345 -0.0617833 -0.0224829 0.1691178 0.0143788 0.0685357 -0.0616915 -0.0053781 0.0153786 -0.0199846 0.1077145 0.0402951 0.047293 0.0980253 0.0408448 0.0471971 0.0183179 0.1083033 -0.0446585 -0.0626371 -0.0032521 0.0515091 -0.1020516 0.0297278 0.053838 -0.0278902 -0.1150375 0.030017 -0.0044169 -0.022226 -0.1689592 0.0147889 -0.0684272 -0.0618231 0.005689 0.0156631 0.020791 0.1075618 0.0170983 -0.0821777 0.075499 -0.102225 -0.0544539 0.061646 0.0135823 -0.0091289 0.0397957 -0.0107317 0.0006108 -0.1308603 0.0008032 0.101626 -0.0000003 -0.0984028 -0.0000035 0.0128658 0.0190843 0.0820476 0.0744708 0.1023712 -0.0571946 -0.0622607 0.0126192 0.0088448 0.0388034 -0.0257273 0.0007368 0.1739067 0.0003267 0.1052128 -0.0009657 0.1280383 -0.0008399 -0.1162985 unknown
polarizability: 145.644376|0.0378789|120.8759339|-2.4761072|0.1213102|75.4151014 unknown
InChI: InChI=1S/C10H13NO/c1-8-5-4-6-9(2)10(8)11(3)7-12/h4-7H,1-3H3
charge 0 multiplicity 1
25 atoms
O  3.442805 0.005877 0.797046
N  1.345449 0.000702 -0.243321
C  -0.09858 0.00031 -0.084235
C  -0.787221 1.24433 -0.009282
C  -0.786894 -1.244044 -0.011982
C  -2.196083 1.223392 0.141092
C  -2.195758 -1.223836 0.138322
C  -2.896302 -0.000394 0.213324
C  -0.031917 2.558589 -0.086112
C  -0.031134 -2.557882 -0.091203
C  1.955667 -0.004473 -1.592182
C  2.179675 0.005536 0.86183
H  -2.742125 2.171837 0.202173
H  -2.74153 -2.172563 0.197425
H  -3.98585 -0.000668 0.329286
H  0.72059 2.643969 0.71917
H  0.517407 2.656441 -1.0409
H  -0.722036 3.414801 -0.001783
H  0.514522 -2.655901 -1.048096
H  0.724512 -2.642319 0.711227
H  -0.720396 -3.414493 -0.003987
H  2.600029 0.882669 -1.729155
H  1.15456 -0.002145 -2.347419
H  2.59227 -0.897653 -1.726612
H  1.615044 0.008916 1.821476
