program: Gaussian 09
title: 000278419
version: EM64L-G09RevD.01
frameworkgroup: C1[X(C12H17NO2)]
method: RPBEPBE
basis: SDD
operation: Freq
keyword: #p
keyword: freq=noraman
keyword: PBEPBE/SDD
title: #p freq=noraman PBEPBE/SDD
converged: NO YES NO NO
title: Mulliken charges:
elementType: O O N C C C C C C C C C C C C H H H H H H H H H H H H H H H H H
charge: -0.277099 -0.196954 -0.003973 -0.107256 -0.458041 0.170843 -0.438465 -0.212726 -0.442622 -0.204309 -0.732629 0.187447 -0.206780 -0.258678 -0.665203 0.242688 0.216904 0.238947 0.204028 0.211980 0.208379 0.213749 0.222324 0.204365 0.235049 0.245636 0.237657 0.238903 0.225602 0.223039 0.225415 0.251777
chargesum: 0.00000
title: Mulliken charges with hydrogens summed into heavy atoms:
elementType: O O N C C C C C C C C C C C C
charge: -0.277099 -0.196954 -0.003973 0.135432 -0.002190 0.170843 -0.022457 -0.004346 -0.006548 0.000056 -0.014287 0.187447 -0.206780 0.205827 0.035029
polarizability: 1.55308955e+02 1.04671135e+00 1.31195734e+02 5.72343728e+00 1.17247407e+00 1.16047430e+02
1716.lowfreq: -10.7360 -0.0005 0.0001 0.0006 5.3799 11.0111 31.6285 49.2871 55.8839
frequency: 30.7902 49.2479 55.7572 71.5627 81.9393 123.3049 139.3410 153.7826 200.4462 212.5080 231.6550 251.0622 260.4443 286.2226 307.7320 346.7270 369.1747 393.7042 427.5519 449.9268 468.6255 517.7662 576.8480 617.4555 685.3561 720.3295 723.4035 751.7240 790.7547 814.9550 823.0720 866.0572 877.1423 910.4490 935.0912 946.6492 974.6357 996.1553 1010.3086 1044.4713 1063.6086 1077.6024 1089.2880 1094.5514 1096.8002 1128.1851 1147.5949 1156.3871 1191.6538 1207.9513 1237.2787 1253.8681 1277.4978 1286.2743 1311.0720 1339.9711 1341.8240 1347.5790 1354.0950 1387.0277 1389.9916 1394.7645 1453.9337 1457.4209 1462.5274 1466.7426 1467.7977 1472.5111 1484.3410 1484.5363 1636.1445 1671.9330 2199.9419 2959.7358 2967.9286 2979.5504 2983.2943 2993.2393 3005.5426 3012.8158 3032.2947 3040.8920 3048.8060 3088.4527 3094.1930 3097.7222 3104.1869 3119.6445 3120.8312 3131.0262
redmass: 3.5297 3.5496 3.2556 4.1087 4.5296 4.6117 3.9692 4.5197 1.8779 1.2453 1.6281 1.8934 2.4419 2.4720 2.6263 4.3014 4.1563 4.7865 5.1450 2.3688 4.3514 4.4423 5.4286 2.0327 4.8830 3.5120 1.8496 2.3664 2.0739 1.9632 2.2669 2.5554 1.7945 2.1721 2.2096 2.1361 1.2666 2.2900 2.5470 3.0548 2.2535 2.7430 1.8359 2.2153 2.1920 1.6359 1.3478 1.6641 2.5705 1.4666 1.2267 1.2886 1.1271 1.5378 1.3496 1.4563 1.4487 1.5457 1.2617 1.2904 1.2319 1.3548 1.0889 1.0912 1.0494 1.0524 1.0822 1.0898 1.0528 1.0541 10.4757 6.9776 12.6426 1.0633 1.0820 1.0646 1.0608 1.0359 1.0345 1.0940 1.0596 1.0989 1.1035 1.0975 1.1029 1.0852 1.0991 1.1016 1.1067 1.0972
irintensity: 0.3599 1.3789 0.3065 0.3469 0.6432 1.9317 0.1741 3.4974 3.0841 0.4196 0.4286 0.0698 0.0752 0.5490 8.2052 1.9684 4.2172 5.6488 4.1420 1.8166 2.2006 3.0513 4.1527 13.9981 5.9922 12.0385 15.1850 10.7190 5.9325 3.2275 1.4771 8.4343 8.0274 3.9091 0.8700 3.1145 0.2508 14.1900 28.5074 5.2047 39.9157 270.9836 9.0020 12.5347 4.8171 19.7031 9.2471 12.4712 80.9355 1.1229 0.8294 1.5363 4.0673 2.4027 2.7902 0.0845 2.1611 0.7359 0.9785 11.1531 25.2063 5.4680 11.3121 11.8194 19.6927 13.9125 3.4486 9.2196 11.6638 23.1705 150.3778 5.9069 3.4858 32.7060 9.1680 24.8022 23.9727 13.9270 14.5484 44.8801 30.8453 44.2943 48.2123 39.2058 1.6026 16.0821 11.0321 10.5983 24.9389 48.4589
temp: 298.150 k
press: 1.00000 atm
elementType: 8 8 7 6 6 6 6 6 6 6 6 6 6 6 6 1 1 1 1 1 1 1 1 1 1 1 1 1 1 1 1 1
symmnumber: 1
zpe: 698062.8 jmol-1
zpe.correction: 0.265878 hartree
zpe.thermalcorrener: 0.282026 hartree
zpe.thermalcorrenthalpy: 0.282971 hartree
zpe.thermalcorrgfe: 0.221686 hartree
zpe.sumelectzpe: -671.492299 hartree
zpe.sumelectthermal: -671.476151 hartree
zpe.sumelectthermalent: -671.475207 hartree
zpe.sumelectthermalfe: -671.536491 hartree
dipole: -1.3879 -3.8931 -4.1131
dipole: 5.8310
quadrupole: -79.0401 -93.6463 -97.5287
quadrupole: -0.3561 2.2567 -11.5225
quadrupole: 11.0316 -3.5746 -7.4570 -0.3561 2.2567 -11.5225
hfenergy: -671.7581772 hartree
pointgroup: C01 [X(C12H17N1O2)]
dipole: 0.6870504 1.7144601 -1.3606586 debye
polarizability: 155.8448479|0.6853497|131.1117891|-3.6380558|1.2268946|115.5954811 unknown
InChI: InChI=1S/C12H17NO2/c1-3-15-11(14)12(2,9-13)10-7-5-4-6-8-10/h5,7,10H,3-4,6,8H2,1-2H3
charge 0 multiplicity 1
32 atoms
O  2.26137 0.257801 -0.697461
O  2.06137 -0.937364 1.294937
N  -1.009369 -2.706702 1.228335
C  -0.663215 0.297576 -0.610809
C  -0.777375 1.11585 0.700714
C  0.232532 -1.004155 -0.41526
C  -1.81186 2.254384 0.553465
C  -2.040779 -0.0393 -1.163628
C  -3.222169 1.682839 0.278263
C  -3.182632 0.57524 -0.757532
C  0.494413 -1.731185 -1.773851
C  1.596596 -0.585698 0.191567
C  -0.434216 -1.942129 0.517519
C  3.602259 0.76625 -0.258684
C  3.452091 2.011232 0.618529
H  -0.104658 0.897784 -1.360128
H  0.210528 1.532335 0.974514
H  -1.088151 0.444968 1.526143
H  -1.513707 2.913785 -0.286259
H  -1.823356 2.87843 1.466727
H  -2.102736 -0.80971 -1.943004
H  -3.904991 2.487157 -0.060845
H  -3.664249 1.287412 1.21731
H  -4.1403 0.264387 -1.1982
H  -0.443016 -2.138487 -2.18453
H  0.931086 -1.019706 -2.493319
H  1.195099 -2.572424 -1.636107
H  4.12149 -0.045972 0.27942
H  4.114106 0.984448 -1.209247
H  4.452098 2.421931 0.850994
H  2.872041 2.79373 0.099211
H  2.954698 1.764291 1.571416
