program: Gaussian 09
title: 000278425
version: EM64L-G09RevD.01
frameworkgroup: C1[X(C10H11N3O5)]
method: RPBEPBE
basis: SDD
operation: Freq
keyword: #p
keyword: freq=noraman
keyword: PBEPBE/SDD
title: #p freq=noraman PBEPBE/SDD
converged: YES YES NO NO
title: Mulliken charges:
elementType: O O O O O N N N C C C C C C C C C C H H H H H H H H H H H
charge: -0.204886 -0.205017 -0.160265 -0.218823 -0.214702 -0.101104 0.010881 0.017419 0.359726 0.304751 -0.325602 -0.483361 0.428110 -0.397494 -0.652810 -0.364154 -0.027557 -0.545696 0.256382 0.315476 0.290849 0.252873 0.231844 0.272072 0.234807 0.211301 0.266697 0.231426 0.216856
chargesum: 0.00000
title: Mulliken charges with hydrogens summed into heavy atoms:
elementType: O O O O O N N N C C C C C C C C C C
charge: -0.204886 -0.205017 -0.160265 -0.218823 -0.214702 -0.101104 0.010881 0.017419 0.359726 0.304751 -0.069220 -0.167885 0.428110 -0.106645 0.103980 0.081954 0.239141 -0.097415
polarizability: 2.76414363e+02 6.29706916e+00 1.62779109e+02 8.19181270e+00 1.19772557e+00 9.39569642e+01
1716.lowfreq: -5.6445 -0.3916 -0.0006 -0.0006 0.0002 6.4466 22.5642 46.4280 60.3177
frequency: 22.3744 46.4275 60.2948 63.4344 75.2415 86.6791 100.7533 109.8027 137.8225 146.7732 170.9813 187.9102 248.9317 260.7248 268.0314 284.3756 311.7956 368.4619 380.2180 425.7558 451.2246 474.1719 504.3276 531.8957 576.1428 595.4457 628.1921 642.7395 682.7555 700.6102 722.1343 726.9826 752.8268 813.9350 828.0909 867.6489 916.8554 931.5804 941.6840 970.1098 980.6136 980.9027 1022.6405 1044.2779 1091.9760 1106.7660 1121.1001 1133.0655 1140.3812 1178.7309 1204.4829 1212.0218 1233.7228 1266.7697 1290.4248 1331.9839 1350.1938 1360.8222 1379.9758 1391.6440 1426.3038 1429.6001 1447.3834 1465.5230 1471.8706 1478.3901 1510.2273 1566.4980 1616.2645 1659.8463 2958.6118 2985.4201 3056.7138 3060.0413 3093.5971 3120.8435 3134.3254 3168.4179 3180.4339 3188.3878 3205.7827
redmass: 6.6122 4.6817 6.3781 6.4497 4.3660 2.8479 3.7201 4.0046 4.5234 8.8877 1.9677 2.0367 4.0052 4.6698 4.7543 4.8831 8.8860 5.6455 4.7434 2.7030 3.4277 4.2134 7.9112 5.3796 3.6304 4.7984 2.2208 6.9022 7.8527 8.2423 6.3022 5.2689 12.4702 1.5588 4.4605 7.2411 3.4675 1.4896 1.4292 1.3246 1.8308 1.3378 1.2118 2.9853 2.2355 1.3526 6.8278 1.4396 1.4626 1.6792 1.4386 7.4031 7.6915 1.5329 1.2291 1.3707 6.0861 2.5775 10.0530 7.0492 1.5147 1.1699 3.0290 1.1257 1.0630 1.1235 3.3988 8.9917 7.2371 4.5559 1.0423 1.0555 1.0957 1.1077 1.0619 1.0981 1.0949 1.0880 1.0927 1.0967 1.1141
irintensity: 1.1826 0.9647 0.7025 1.5436 0.7399 0.3438 4.6758 2.0539 2.6374 7.6684 0.1737 0.1098 1.6577 13.1231 2.9172 1.6485 1.9884 3.8315 3.9670 2.6294 9.5996 4.6113 0.8925 4.0381 0.3914 8.1800 14.5941 8.7179 28.7722 9.9972 1.3972 5.4534 8.7627 20.1213 89.5742 8.3308 3.9470 22.4605 18.7345 74.8616 3.2317 3.3544 15.1805 4.4303 24.0257 21.0431 8.5490 5.7667 8.2970 92.7239 2.2158 640.8793 132.2723 51.4308 2.7989 1.1367 78.6906 54.3505 113.0767 83.9405 2.8155 24.6609 2.3568 12.9235 21.8015 16.1473 85.5927 14.7592 323.3492 1.0640 55.1615 23.8076 16.8999 30.9200 9.1975 2.5598 2.0170 3.0879 8.9728 5.2035 16.2839
temp: 298.150 k
press: 1.00000 atm
elementType: 8 8 8 8 8 7 7 7 6 6 6 6 6 6 6 6 6 6 1 1 1 1 1 1 1 1 1 1 1
symmnumber: 1
zpe: 544678.4 jmol-1
zpe.correction: 0.207457 hartree
zpe.thermalcorrener: 0.225279 hartree
zpe.thermalcorrenthalpy: 0.226223 hartree
zpe.thermalcorrgfe: 0.159861 hartree
zpe.sumelectzpe: -926.441572 hartree
zpe.sumelectthermal: -926.423750 hartree
zpe.sumelectthermalent: -926.422806 hartree
zpe.sumelectthermalfe: -926.489168 hartree
dipole: 5.9004 6.4028 -1.8952
dipole: 8.9108
quadrupole: -122.6573 -96.2769 -109.3826
quadrupole: 1.0984 -13.1205 1.2459
quadrupole: -13.2184 13.1621 0.0563 1.0984 -13.1205 1.2459
hfenergy: -926.6490287 hartree
pointgroup: C01 [X(C10H11N3O5)]
dipole: 2.5076738 -1.7621662 -1.7020314 debye
polarizability: 276.5610135|-4.0589354|103.786133|8.1654942|24.2232824|152.8032888 unknown
InChI: InChI=1S/C10H11N3O5/c1-3-6-18-11(2)9-5-4-8(12(14)15)7-10(9)13(16)17/h3-5,7H,1,6H2,2H3
charge 0 multiplicity 1
29 atoms
O  2.496357 0.072927 -0.309181
O  0.690724 1.07836 2.24266
O  1.109922 2.423548 0.443954
O  -4.817344 -0.762188 -0.770818
O  -4.34392 0.361039 1.164662
N  1.527158 -0.202393 -1.341425
N  0.575376 1.394404 0.993667
N  -3.992757 -0.182245 0.043049
C  0.185504 -0.113873 -1.029026
C  -0.304463 0.544391 0.150485
C  -0.793878 -0.724126 -1.88291
C  -1.653131 0.49884 0.522323
C  -2.574474 -0.141331 -0.331066
C  -2.150388 -0.732051 -1.546624
C  2.077805 -0.750204 -2.58289
C  2.735797 -1.165622 0.56308
C  3.554506 -0.690288 1.726583
C  4.809893 -1.134863 1.983352
H  -0.468465 -1.221845 -2.799746
H  -2.001955 0.979035 1.440859
H  -2.892797 -1.20874 -2.191947
H  1.574273 -0.297806 -3.455072
H  1.989808 -1.854039 -2.645257
H  3.141361 -0.469321 -2.617633
H  1.743313 -1.538809 0.882263
H  3.26269 -1.929157 -0.038526
H  3.070635 0.043302 2.38383
H  5.369651 -0.785266 2.857291
H  5.310998 -1.864978 1.335064
