program: Gaussian 09
title: 000025264
version: EM64L-G09RevD.01
frameworkgroup: C1[X(C20H25NO2)]
method: RPBEPBE
basis: SDD
operation: Freq
keyword: #p
keyword: freq=noraman
keyword: PBEPBE/SDD
title: #p freq=noraman PBEPBE/SDD
converged: YES YES NO NO
title: Mulliken charges:
elementType: O O N C C C C C C C C C C C C C C C C C C C C H H H H H H H H H H H H H H H H H H H H H H H H H
charge: -0.269638 -0.218096 -0.107498 -0.349255 -0.423227 -0.321345 -0.321332 -0.300284 -0.675603 -0.678596 0.262162 0.135728 -0.365613 -0.003479 -0.342690 0.360384 -0.226597 -0.255966 -0.348393 -0.369007 -0.246097 -0.236149 -0.234966 0.185002 0.244196 0.211799 0.216747 0.184503 0.203907 0.193998 0.209782 0.222038 0.198931 0.228188 0.205559 0.205715 0.225846 0.205505 0.206673 0.252913 0.264341 0.227896 0.233330 0.246932 0.271475 0.228554 0.230479 0.231247
chargesum: 0.00000
title: Mulliken charges with hydrogens summed into heavy atoms:
elementType: O O N C C C C C C C C C C C C C C C C C C C C
charge: -0.269638 -0.218096 -0.107498 0.079943 0.005319 0.067065 0.082448 0.120685 -0.036141 -0.040571 0.262162 0.135728 -0.112700 -0.003479 -0.078349 0.360384 0.001298 -0.022637 -0.101461 -0.097532 -0.017543 -0.005670 -0.003719
polarizability: 2.84147118e+02 -3.29036790e+01 2.26746349e+02 -1.14464598e+01 -2.00390107e+01 1.79246862e+02
1716.lowfreq: -11.2278 -8.8387 -0.0008 -0.0003 0.0001 5.5683 11.6194 15.4150 30.3567
frequency: 5.1213 14.6862 30.3147 41.1135 46.1163 71.0039 73.5105 79.5127 84.9678 97.2232 111.5329 143.4933 173.7321 175.4568 198.2240 215.3065 233.9071 252.4349 261.0004 278.0913 293.0795 307.8531 346.0476 383.4558 399.9280 404.0058 414.4397 434.5417 455.6292 470.8333 504.1816 513.0378 572.2768 602.5716 612.9387 632.0739 684.1275 701.2036 703.4286 742.0007 742.7452 755.4348 760.3741 792.5495 794.3397 803.7448 809.5374 854.3931 860.8691 894.8797 903.8133 917.1169 931.8321 944.7736 949.0577 980.1102 987.6576 989.8119 995.0883 1002.8656 1024.3915 1032.1960 1047.3203 1062.6700 1072.5897 1075.2630 1081.0998 1083.9916 1099.0416 1100.1980 1125.5187 1153.9388 1160.5605 1171.9732 1174.8113 1185.3262 1201.5298 1217.4872 1223.8814 1239.8869 1256.6347 1279.2694 1287.9170 1294.9850 1302.1506 1316.6976 1328.0281 1359.6767 1362.9394 1366.7058 1381.0195 1383.7467 1385.1637 1386.1005 1388.6830 1429.3476 1434.8077 1448.9832 1462.1559 1463.4530 1464.9855 1471.1672 1476.7003 1477.9912 1483.4477 1485.8084 1488.1417 1491.6765 1538.9958 1581.4310 1589.5128 1602.5324 1607.7113 2846.6586 2863.8594 2916.6843 2951.2306 2980.8231 2982.9295 2999.3866 3018.9241 3019.5985 3029.9233 3032.7636 3064.9590 3072.6987 3075.4321 3089.8388 3090.0914 3124.5829 3133.1361 3134.7173 3146.2861 3147.4035 3156.5474 3162.8264 3166.8251 3173.1695
redmass: 3.3224 4.3440 4.5985 5.6915 4.0570 3.0996 3.4531 2.0226 3.2511 3.1890 4.3121 4.1388 3.7142 1.8125 2.2601 1.4443 1.9197 4.8797 2.2324 3.2178 2.1314 3.1096 6.2131 2.8531 3.0638 3.5886 3.2791 4.2853 2.6350 4.1063 3.3909 3.3885 4.6988 5.2690 6.4493 5.7245 4.3519 2.2761 2.5953 2.4286 2.0824 2.1913 1.4660 1.1496 1.2025 2.3689 2.4568 1.5425 1.2458 1.9278 3.3524 3.1675 2.3122 1.4346 1.4930 1.3348 1.4340 5.3033 2.2560 1.3280 2.2224 2.5903 2.1662 2.3909 1.8017 2.0726 1.6082 2.2005 2.2474 2.4909 1.9297 2.1652 1.5668 1.0581 1.0789 1.1404 2.2817 2.7195 1.4124 1.5120 2.1379 1.1212 1.2320 2.0097 1.1706 1.3589 1.3337 1.5322 1.4694 1.3448 3.5204 1.2632 1.4303 8.4354 1.2586 2.2687 2.3068 1.0810 1.0532 1.0750 1.6280 1.0561 2.1413 1.0696 1.3984 1.0767 1.0749 1.0774 10.3868 6.9846 6.4163 6.2387 6.1080 1.0722 1.0715 1.0673 1.0561 1.0357 1.0357 1.0685 1.0916 1.0972 1.0876 1.0875 1.1021 1.0983 1.0979 1.1003 1.1002 1.0849 1.0859 1.0881 1.0927 1.0900 1.0961 1.0938 1.1009 1.0997
irintensity: 0.1037 0.8519 0.2525 2.5358 0.2599 0.5344 0.6617 0.4700 0.7895 0.9061 2.1528 0.4483 0.0715 2.8939 1.2019 0.2428 1.2354 3.0556 1.7661 1.0564 1.3100 1.2144 2.3544 3.0224 0.4439 2.3953 2.1781 0.7729 5.7072 2.2194 1.9412 9.3468 4.4104 5.6145 0.0298 31.7787 3.9888 47.7493 49.3933 9.6767 4.3279 54.7483 48.1791 6.9125 5.1324 9.3488 10.3002 0.3692 1.6577 0.4723 32.0297 43.9845 26.5691 3.5177 8.5238 1.3290 1.7577 1.1141 3.2365 0.9581 2.4638 31.5295 10.6441 23.5721 7.4468 25.4462 11.1363 2.4130 1.3611 49.1221 10.9362 12.6642 19.6695 0.1674 13.7269 12.2439 33.1608 162.7673 21.1916 7.4161 70.8920 1.7814 24.5699 179.3362 7.3004 16.4887 1.5663 10.6552 1.3596 5.7819 16.3946 21.5628 5.9400 5.9804 19.0614 29.7245 67.1708 11.4034 5.6704 3.5444 64.8806 1.9614 1.3778 3.4911 6.5963 10.0819 6.6500 15.0073 139.2641 22.6914 14.9693 111.8514 4.8323 52.6871 109.7197 72.9494 40.8987 34.3285 34.9473 9.7251 30.0805 34.1622 9.9502 20.2191 36.2132 50.0104 71.6679 23.1692 54.3702 0.1413 4.2992 5.0237 19.9437 5.7505 18.0923 20.6175 20.9544 18.4184
temp: 298.150 k
press: 1.00000 atm
elementType: 8 8 7 6 6 6 6 6 6 6 6 6 6 6 6 6 6 6 6 6 6 6 6 1 1 1 1 1 1 1 1 1 1 1 1 1 1 1 1 1 1 1 1 1 1 1 1 1
symmnumber: 1
zpe: 1055279.4 jmol-1
zpe.correction: 0.401935 hartree
zpe.thermalcorrener: 0.425262 hartree
zpe.thermalcorrenthalpy: 0.426206 hartree
zpe.thermalcorrgfe: 0.344939 hartree
zpe.sumelectzpe: -980.586323 hartree
zpe.sumelectthermal: -980.562996 hartree
zpe.sumelectthermalent: -980.562052 hartree
zpe.sumelectthermalfe: -980.643319 hartree
dipole: -1.8846 -2.5234 2.9886
dipole: 4.3418
quadrupole: -135.2929 -130.7752 -139.5823
quadrupole: -15.5811 5.0306 1.1555
quadrupole: -0.0761 4.4416 -4.3655 -15.5811 5.0306 1.1555
hfenergy: -980.9882576 hartree
pointgroup: C01 [X(C20H25N1O2)]
dipole: -0.5568983 -0.4886684 1.5391342 debye
polarizability: 288.9767177|-31.3693298|199.5731623|-3.6530153|-27.7753626|201.5904485 unknown
InChI: InChI=1S/C20H25NO2/c1-3-21(4-2)15-10-16-23-19-14-9-8-13-18(19)20(22)17-11-6-5-7-12-17/h5-9,11-14H,3-4,10,15-16H2,1-2H3
charge 0 multiplicity 1
48 atoms
O  0.909458 -1.155181 0.025773
O  2.386881 1.394545 -2.570318
N  -3.390156 -1.173165 0.419192
C  -1.976895 -1.180231 0.886989
C  -1.178548 -2.355825 0.283841
C  -4.319483 -0.56641 1.41113
C  -3.525594 -0.558566 -0.932862
C  0.301932 -2.343155 0.668045
C  -4.619973 -1.497393 2.60173
C  -4.769578 -1.052901 -1.694962
C  2.290458 -0.966606 0.142275
C  2.839715 0.139674 -0.575465
C  3.141868 -1.835142 0.872214
C  2.012074 1.099472 -1.392293
C  4.246418 0.307761 -0.591621
C  0.812378 1.774293 -0.792942
C  4.536975 -1.616854 0.872116
C  5.098454 -0.551018 0.133705
C  0.649899 1.907151 0.610767
C  -0.137197 2.372284 -1.663723
C  -0.441162 2.632875 1.135025
C  -1.238204 3.078792 -1.139642
C  -1.390413 3.215136 0.262148
H  -1.975304 -1.285831 1.988601
H  -1.459102 -0.22048 0.654729
H  -1.628033 -3.307216 0.627401
H  -1.25366 -2.345602 -0.819368
H  -3.932453 0.41681 1.784582
H  -5.270469 -0.349602 0.89129
H  -3.532399 0.559166 -0.869334
H  -2.625578 -0.823543 -1.517221
H  0.814147 -3.255191 0.300118
H  0.436445 -2.273287 1.76826
H  -5.054705 -2.44534 2.239628
H  -3.708802 -1.739902 3.178706
H  -5.3368 -1.019565 3.295853
H  -4.738637 -2.151575 -1.798569
H  -5.708175 -0.788019 -1.174815
H  -4.808395 -0.601336 -2.704099
H  2.730659 -2.682428 1.427825
H  4.6560 1.131352 -1.185915
H  5.184591 -2.292711 1.441951
H  6.181376 -0.393239 0.121852
H  1.388333 1.461307 1.285924
H  0.015937 2.276871 -2.743869
H  -0.551592 2.746853 2.219121
H  -1.971464 3.531178 -1.816505
H  -2.239629 3.775194 0.670135
