program: Gaussian 09
title: 000278418
version: EM64L-G09RevD.01
frameworkgroup: C1[X(C13H21NO2)]
method: RPBEPBE
basis: SDD
operation: Freq
keyword: #p
keyword: freq=noraman
keyword: PBEPBE/SDD
title: #p freq=noraman PBEPBE/SDD
converged: YES YES NO NO
title: Mulliken charges:
elementType: O O N C C C C C C C C C C C C C H H H H H H H H H H H H H H H H H H H H H
charge: -0.263598 -0.225199 -0.003819 0.056392 0.334422 -0.454768 -0.383779 -0.249178 -0.348374 -0.751004 -0.848306 0.239564 -0.693117 -0.206937 -0.261135 -0.662106 0.212141 0.217066 0.198277 0.197220 0.221269 0.192863 0.194780 0.235016 0.237915 0.247155 0.252702 0.240742 0.270097 0.218193 0.208968 0.209888 0.225521 0.237570 0.220912 0.254639 0.228007
chargesum: 0.00000
title: Mulliken charges with hydrogens summed into heavy atoms:
elementType: O O N C C C C C C C C C C C C C
charge: -0.263598 -0.225199 -0.003819 0.056392 0.334422 -0.025561 0.011718 -0.027908 0.039269 -0.030918 -0.084765 0.239564 -0.056067 -0.206937 0.201956 0.041452
polarizability: 1.82104846e+02 9.46765908e+00 1.52448621e+02 -3.66184982e+00 -6.28049233e+00 1.25278785e+02
1716.lowfreq: -10.2554 -2.5666 -0.6932 -0.0008 -0.0007 -0.0006 11.8063 31.5340 35.4327
frequency: -9.7616 31.3804 35.4227 56.2793 63.7165 70.9009 90.7196 103.3989 121.6913 130.8358 146.4712 158.9867 200.5346 211.7253 219.4551 236.9868 245.9634 257.0951 280.5829 321.3687 339.4967 363.7594 388.5506 407.9445 442.0395 457.8724 475.9527 499.8897 586.3301 646.1843 706.1449 718.8060 729.3111 760.5803 791.6728 816.6181 842.8600 847.3072 896.3838 903.8498 928.7451 975.0124 1007.2470 1018.3780 1046.9058 1066.3581 1076.0652 1085.1679 1095.4559 1096.5184 1097.7862 1113.4235 1151.9024 1157.5466 1171.1977 1198.6003 1209.0904 1249.0261 1276.7377 1277.0026 1288.9109 1315.8862 1353.4586 1354.2432 1359.9231 1389.9847 1393.1733 1394.1959 1409.8477 1450.7915 1457.1562 1463.8151 1466.4472 1467.3936 1470.1830 1474.9632 1477.0264 1478.1745 1484.6255 1485.1334 1486.4794 1621.0175 1670.8227 2194.3983 2949.3796 2958.1731 2968.4074 2972.7828 2978.3229 2985.9028 2994.9675 3003.9008 3011.4015 3032.2457 3032.5453 3054.0701 3068.6868 3072.5950 3090.0268 3096.4482 3098.5091 3107.6555 3116.1303 3122.4778 3130.6029
redmass: 2.5918 2.9709 3.6820 2.9392 2.2712 3.5933 5.3003 2.1264 2.6939 3.9203 1.3458 3.2793 1.8461 2.2940 1.2515 1.8408 2.3253 2.6735 1.2659 3.0022 2.9143 3.8413 3.0762 4.6832 4.8859 4.1000 3.7948 3.4260 5.5145 4.0515 4.1626 1.2955 2.4238 1.2626 2.1528 1.6515 1.7834 2.0567 1.8205 1.9429 1.2877 2.3810 2.5144 3.1417 1.4550 2.5742 2.3804 2.8555 1.6371 1.8675 2.1564 2.8596 2.4900 1.7801 3.0559 3.7015 1.4484 1.3456 1.1719 1.1287 1.0592 1.3755 1.2790 1.5079 1.5567 1.2163 1.1980 1.2115 1.2251 1.0720 1.0957 1.0454 1.0681 1.0495 1.0529 1.0672 1.0424 1.0645 1.0506 1.0503 1.0814 9.9175 7.3577 12.6586 1.0596 1.0588 1.0595 1.0361 1.0389 1.0976 1.0361 1.1008 1.0354 1.0903 1.0726 1.0959 1.1007 1.0993 1.0975 1.1031 1.0979 1.1008 1.0901 1.1064 1.0998
irintensity: 0.6791 0.7643 0.5012 0.2893 0.1126 1.1554 0.8756 0.0108 1.1936 1.7157 0.1025 3.6650 3.1464 1.0591 0.1880 0.3146 0.7477 1.3985 2.4402 12.4631 1.1029 1.2791 0.7783 2.9496 2.9172 0.8568 4.8376 4.9819 3.3124 9.9340 3.7049 13.2494 4.1913 1.5541 3.0340 4.9688 6.1827 6.1743 7.8184 0.8741 0.2697 0.1425 31.4445 8.9685 10.6046 121.0063 20.6450 152.9084 12.7909 32.9019 5.4892 27.8885 91.7704 3.2198 1.4949 64.4046 0.4750 0.3487 0.5361 4.1099 0.4151 0.0470 0.5596 1.0668 11.2155 12.2412 24.1839 16.4738 35.3070 4.1189 13.0541 15.5208 1.9466 10.5614 10.4916 4.1779 13.3511 13.3521 7.4972 23.1280 15.6543 149.9250 2.2017 6.6906 6.9734 2.9676 78.4360 41.7699 12.7094 4.7354 17.6062 1.1030 11.6132 20.4148 61.9595 6.5417 83.0017 51.7009 31.3068 1.1062 15.4134 24.6284 11.5262 26.6991 10.6977
temp: 298.150 k
press: 1.00000 atm
elementType: 8 8 7 6 6 6 6 6 6 6 6 6 6 6 6 6 1 1 1 1 1 1 1 1 1 1 1 1 1 1 1 1 1 1 1 1 1
symmnumber: 1
zpe: 820378.2 jmol-1
zpe.correction: 0.312466 hartree
zpe.thermalcorrener: 0.331630 hartree
zpe.thermalcorrenthalpy: 0.332574 hartree
zpe.thermalcorrgfe: 0.263988 hartree
zpe.sumelectzpe: -711.887440 hartree
zpe.sumelectthermal: -711.868276 hartree
zpe.sumelectthermalent: -711.867332 hartree
zpe.sumelectthermalfe: -711.935918 hartree
dipole: -2.8086 -4.9222 0.7205
dipole: 5.7128
quadrupole: -100.2792 -104.7711 -97.2160
quadrupole: -18.2112 3.7303 -0.0101
quadrupole: 0.4762 -4.0157 3.5394 -18.2112 3.7303 -0.0101
hfenergy: -712.1999057 hartree
pointgroup: C01 [X(C13H21N1O2)]
dipole: -1.6475835 -1.5242331 0.1175014 debye
polarizability: 185.3296383|-0.2182009|149.9297764|-0.6990394|-4.3031684|124.5728368 unknown
InChI: InChI=1S/C13H21NO2/c1-5-7-8-9-11(3)13(4,10-14)12(15)16-6-2/h9H,5-8H2,1-4H3
charge 0 multiplicity 1
37 atoms
O  1.226993 -2.159037 0.435484
O  2.552955 -0.901419 -1.009699
N  3.086074 2.149551 0.881738
C  1.201712 0.253262 0.741905
C  0.010152 0.78119 -0.126749
C  -2.513796 0.974524 -0.531737
C  -3.830665 0.487399 0.115846
C  -1.277926 0.538538 0.240784
C  -5.086068 0.921115 -0.672392
C  0.82392 -0.109338 2.20491
C  0.395662 1.534235 -1.386042
C  1.76903 -0.973376 -0.037999
C  -6.400592 0.428355 -0.030501
C  2.261471 1.293127 0.792683
C  1.626339 -3.410391 -0.291163
C  2.937619 -3.96338 0.270397
H  -2.464091 0.597919 -1.575445
H  -2.537641 2.081425 -0.616544
H  -3.896328 0.876152 1.15322
H  -3.812171 -0.619325 0.19609
H  -1.477092 -0.01276 1.169246
H  -5.013629 0.537997 -1.711113
H  -5.102697 2.027535 -0.750761
H  0.376875 0.767568 2.702069
H  1.722802 -0.415205 2.765634
H  0.113316 -0.948385 2.225082
H  0.75866 2.551521 -1.142644
H  -0.459755 1.635701 -2.073039
H  1.218525 1.025915 -1.921762
H  -7.28173 0.750375 -0.615098
H  -6.421878 -0.676112 0.032108
H  -6.513863 0.824305 0.99644
H  0.775958 -4.087689 -0.114215
H  1.713629 -3.174459 -1.366115
H  3.1729 -4.926367 -0.219471
H  3.771792 -3.268321 0.077811
H  2.859739 -4.139643 1.35704
