program: Gaussian 09
title: 000025139
version: EM64L-G09RevD.01
frameworkgroup: C1[X(C10H22O)]
method: RPBEPBE
basis: SDD
operation: Freq
keyword: #pfreq=noraman
keyword: PBEPBE/SDD
title: #p freq=noraman PBEPBE/SDD
converged: YES YES NO NO
title: Mulliken charges:
elementType: O C C C C C C C C C C H H H H H H H H H H H H H H H H H H H H H H
charge: -0.461227 -0.413615 -0.394388 0.306587 -0.377477 -0.374536 -0.353182 -0.717649 -0.748359 -0.356827 -0.696040 0.189252 0.212256 0.210967 0.169996 0.196961 0.192203 0.189523 0.189263 0.187999 0.189325 0.228710 0.228889 0.198064 0.232450 0.216407 0.208709 0.195046 0.194835 0.320385 0.210168 0.209752 0.215554
chargesum: 0.00000
title: Mulliken charges with hydrogens summed into heavy atoms:
elementType: O C C C C C C C C C C
charge: -0.140843 -0.012108 -0.013424 0.306587 0.011687 0.004250 0.024142 -0.061987 -0.090793 0.033054 -0.060566
polarizability: 1.41032403e+02 -1.82452266e+00 1.01747316e+02 -1.62685148e+00 8.15346310e-01 9.79182417e+01
1716.lowfreq: -34.4391 -7.1289 -0.0009 -0.0006 0.0005 2.4916 22.9539 33.0031 58.5951
frequency: -13.0805 32.6675 58.3977 70.8605 84.4305 128.5507 132.3530 149.4935 190.4396 208.4112 230.8009 240.2744 260.1492 288.1232 328.7839 351.0984 395.3970 405.8302 432.0162 483.0047 526.5982 719.0358 727.2065 741.9654 754.9453 814.7920 870.4012 888.0750 893.9419 926.8455 936.8301 980.0643 995.5949 1004.7090 1026.7336 1049.6560 1066.5939 1078.9813 1080.2939 1097.7339 1123.0970 1182.7969 1202.1798 1213.6890 1233.6032 1248.5627 1261.0525 1280.0256 1283.9529 1293.4785 1296.1363 1307.2661 1321.0388 1346.4320 1352.2404 1363.0908 1377.5952 1387.3908 1392.2817 1441.5171 1456.0880 1458.4644 1461.2177 1465.8008 1467.3025 1472.4391 1474.2152 1477.0667 1481.1978 1486.7430 1487.3922 2941.4304 2949.3444 2952.1956 2959.2943 2967.1429 2969.7320 2971.3994 2977.0030 2984.0861 2990.2884 2993.2856 3003.8288 3019.2554 3032.7577 3042.9377 3068.0167 3068.0410 3070.4307 3084.5514 3092.3064 3095.8600 3544.9213
redmass: 1.7540 3.3353 3.3740 1.6607 2.7778 1.7906 2.2632 3.2114 1.0798 2.9851 1.1118 1.1769 2.4414 1.1260 2.3527 2.7556 2.7035 2.6995 2.9101 2.7930 2.9182 1.0662 1.1118 4.0968 1.1789 1.2820 2.5161 1.8862 1.4251 1.4257 1.6603 1.4765 1.3074 2.8204 2.7419 2.2762 1.5996 2.1509 2.1590 1.5847 2.2722 2.0309 1.8188 1.3348 1.8528 1.6296 1.3111 1.1661 1.1052 1.2265 1.3053 1.1663 1.5129 1.5355 1.6926 1.6020 1.3070 1.2167 1.2229 1.0762 1.0603 1.0726 1.0707 1.0804 1.0500 1.0738 1.0733 1.0432 1.0831 1.0529 1.0870 1.0620 1.0587 1.0590 1.0593 1.0587 1.0583 1.0364 1.0370 1.0962 1.0358 1.0957 1.0998 1.1034 1.1039 1.1036 1.1001 1.0992 1.0993 1.0998 1.0997 1.0996 1.0654
irintensity: 0.1307 0.5582 0.0902 0.4161 1.5689 1.3619 0.7315 0.2147 3.9813 1.0623 0.0033 9.7527 7.4646 137.0571 3.6048 9.0642 1.9865 0.6957 11.2010 1.2812 4.0308 12.8815 0.6909 6.3648 2.9973 3.3734 21.1551 4.5809 1.0832 0.9277 14.6782 0.6536 2.0813 0.2898 8.0101 1.8237 3.5845 1.4633 2.0776 40.3871 25.1635 8.8895 13.4488 17.1572 26.1485 12.9550 7.3282 2.2638 1.0238 7.4004 7.9194 4.0653 10.2956 5.3607 0.5833 8.0647 37.7730 11.6002 20.5949 0.6818 2.1803 0.0842 0.3149 1.5022 5.3273 4.9760 0.7723 12.2451 4.8163 16.6965 22.4488 14.7049 1.0074 0.6107 24.3494 74.0309 102.1444 40.0571 16.0309 0.4874 24.7659 1.8489 0.8896 0.3023 15.9841 156.7906 53.8886 79.9099 53.9510 14.7325 44.0568 47.4307 3.9908
temp: 298.150 k
press: 1.00000 atm
elementType: 8 6 6 6 6 6 6 6 6 6 6 1 1 1 1 1 1 1 1 1 1 1 1 1 1 1 1 1 1 1 1 1 1
symmnumber: 1
zpe: 786697.4 jmol-1
zpe.correction: 0.299637 hartree
zpe.thermalcorrener: 0.314170 hartree
zpe.thermalcorrenthalpy: 0.315114 hartree
zpe.thermalcorrgfe: 0.257934 hartree
zpe.sumelectzpe: -468.541751 hartree
zpe.sumelectthermal: -468.527218 hartree
zpe.sumelectthermalent: -468.526274 hartree
zpe.sumelectthermalfe: -468.583454 hartree
dipole: -1.4402 0.5315 -1.4005
dipole: 2.0780
quadrupole: -80.7081 -71.1202 -73.3675
quadrupole: 0.4239 -6.7956 1.2102
quadrupole: -5.6428 3.9451 1.6977 0.4239 -6.7956 1.2102
hfenergy: -468.8413885 hartree
pointgroup: C01 [X(C10H22O1)]
dipole: -0.5677826 0.1745341 -0.5617287 debye
polarizability: 141.0350138|-1.8437785|101.8241712|-1.5785855|0.5795811|97.8387761 unknown
InChI: InChI=1S/C10H22O/c1-4-5-6-7-8-9-10(2,3)11/h11H,4-9H2,1-3H3
charge 0 multiplicity 1
33 atoms
O  3.328937 0.470642 1.40488
C  1.80956 -0.671476 -0.210152
C  0.583411 0.257721 -0.056803
C  3.200442 -0.005296 -0.003429
C  -0.754035 -0.516533 -0.108383
C  -1.995727 0.3979 -0.009639
C  -3.330921 -0.379962 -0.034958
C  4.320223 -1.051517 -0.136913
C  3.434589 1.183586 -0.964448
C  -4.574451 0.535141 0.042471
C  -5.903251 -0.251245 0.027145
H  1.785461 -1.135094 -1.217713
H  1.725911 -1.496191 0.525751
H  0.584538 1.029271 -0.852777
H  0.635195 0.800216 0.912601
H  -0.776853 -1.259507 0.715687
H  -0.802402 -1.098991 -1.052408
H  -1.938569 0.995792 0.92432
H  -1.981189 1.127239 -0.846708
H  -3.383677 -0.989674 -0.961441
H  -3.353322 -1.098819 0.810802
H  4.160544 -1.873981 0.58192
H  5.298761 -0.590247 0.08211
H  4.345009 -1.471229 -1.158584
H  4.435103 1.615503 -0.787001
H  2.685819 1.983177 -0.811691
H  3.373805 0.862336 -2.021003
H  -4.517553 1.149408 0.964461
H  -4.554914 1.248029 -0.807152
H  2.641267 1.167694 1.562865
H  -5.95942 -0.94982 0.883404
H  -5.999206 -0.849189 -0.898949
H  -6.776185 0.424819 0.084737
