program: Gaussian 09
title: 000278395
version: EM64L-G09RevD.01
frameworkgroup: C1[X(C8H7ClN4)]
method: RPBEPBE
basis: SDD
operation: Freq
keyword: #p
keyword: freq=noraman
keyword: PBEPBE/SDD
title: #p freq=noraman PBEPBE/SDD
converged: NO YES NO NO
title: Mulliken charges:
elementType: Cl N N N N C C C C C C C C H H H H H H H
charge: -0.010853 -0.074254 0.037465 0.047152 -0.597885 -0.138108 0.215539 0.138544 -0.258488 0.154651 -0.260973 -0.781908 -0.399758 0.272610 0.242142 0.234868 0.248623 0.234857 0.339255 0.356521
chargesum: 0.00000
title: Mulliken charges with hydrogens summed into heavy atoms:
elementType: Cl N N N N C C C C C C C C
charge: -0.010853 -0.074254 0.037465 0.047152 0.097891 -0.138108 0.215539 0.138544 0.014122 0.154651 -0.018831 -0.063560 -0.399758
polarizability: 2.00386690e+02 -4.17049191e+00 1.34583691e+02 -3.56495828e-03 3.46595910e-03 5.21417168e+01
1716.lowfreq: -0.0021 -0.0017 -0.0010 8.2947 8.5000 14.3151 64.6635 78.8973 151.4083
frequency: 64.6562 78.8703 151.4079 178.6264 188.8020 204.4014 243.7805 320.5191 359.5150 363.4672 443.4738 487.8112 518.3456 543.4106 548.4631 558.9746 578.5069 646.8334 667.7165 692.9684 708.1112 783.1288 821.4707 852.2024 873.2207 908.5735 987.9810 990.8214 1016.5270 1046.2157 1093.4510 1150.0826 1201.1308 1251.0337 1287.1442 1328.7440 1333.7666 1387.5699 1396.9260 1430.8306 1459.9566 1466.1384 1499.7593 1518.5582 1534.8193 1594.5536 1612.5664 2984.0227 3060.5072 3119.7648 3144.1570 3174.7674 3509.1066 3675.4469
redmass: 4.0508 1.1085 5.1513 5.4047 5.2202 7.2170 4.0992 5.6433 4.2918 4.2505 3.7612 8.2673 6.5296 4.4164 2.5706 6.8653 1.5249 1.0950 9.8622 6.1994 4.9008 7.2385 3.9072 1.7649 7.6724 3.8475 2.0846 1.3303 1.9461 1.5838 2.5495 1.6262 3.4249 2.3217 5.4927 7.0410 5.1811 2.5494 1.7247 3.2456 1.3568 1.0456 2.8325 3.0462 4.4498 4.0882 2.7726 1.0385 1.0971 1.0982 1.0897 1.0976 1.0449 1.1047
irintensity: 0.0022 0.6001 6.9910 0.5596 1.9830 1.7671 4.7749 16.2216 0.9710 3.2303 7.5929 0.8693 12.6207 3.3656 16.9166 8.1914 166.9794 80.1480 2.9510 3.4863 26.9977 18.6862 3.3538 32.0859 36.3190 5.1177 22.3072 0.8259 75.7031 8.8970 25.8552 0.5474 121.4461 0.8112 67.7165 69.8765 110.3280 45.2613 46.6310 10.0524 80.5392 16.4561 62.3351 218.4096 52.5410 96.6088 397.7907 18.1108 15.8426 8.7089 8.6972 6.1538 105.8255 76.4745
temp: 298.150 k
press: 1.00000 atm
elementType: 17 7 7 7 7 6 6 6 6 6 6 6 6 1 1 1 1 1 1 1
symmnumber: 1
zpe: 377084.5 jmol-1
zpe.correction: 0.143624 hartree
zpe.thermalcorrener: 0.154571 hartree
zpe.thermalcorrenthalpy: 0.155515 hartree
zpe.thermalcorrgfe: 0.106396 hartree
zpe.sumelectzpe: -987.225310 hartree
zpe.sumelectthermal: -987.214364 hartree
zpe.sumelectthermalent: -987.213420 hartree
zpe.sumelectthermalfe: -987.262539 hartree
dipole: 6.0088 1.5492 -0.0005
dipole: 6.2053
quadrupole: -82.3299 -70.0904 -83.7422
quadrupole: -5.7107 -0.0020 -0.0014
quadrupole: -3.6091 8.6304 -5.0214 -5.7107 -0.0020 -0.0014
hfenergy: -987.3689343 hartree
pointgroup: C01 [X(C8H7Cl1N4)]
dipole: -2.318017 0.7651021 0.0403851 debye
dipolederiv: -1.0451717 0.1923609 0.0181435 0.2461674 -0.1719866 -0.0043307 0.0182969 -0.0032965 -0.0848555 -0.4933703 0.2152619 0.0034416 -0.1318737 -0.3549686 0.0037863 0.0065003 -0.0031926 -0.2268607 -1.3895454 -0.0257285 0.0249883 -0.4222104 -0.6148108 0.0125225 0.028681 0.0042612 -0.1746779 -0.8254415 0.5868435 0.0078353 0.3347363 -1.0626735 0.0003847 0.0103072 -0.0043977 -0.1950595 -0.2689957 0.2445685 -0.0095926 0.0979556 -1.4552895 0.004968 -0.008441 0.0020915 -0.6463902 -0.1410403 -0.3910684 0.0084371 0.2062822 -0.3026461 -0.0006461 0.0030171 0.0113205 0.1050871 0.7517278 -0.058545 -0.0127787 -0.1689414 0.0066418 0.0041158 -0.0119389 0.0018658 0.0905031 0.7278882 -0.1703899 -0.0125945 -0.3087001 0.0635523 0.0058306 -0.0115445 0.0030831 0.0269731 -0.0631829 0.0353644 -0.0015669 -0.0387579 0.2173049 -0.0022683 -0.0009953 -0.0037246 -0.1270638 0.5774376 -0.34101 -0.0049056 -0.0605828 1.721734 -0.0119201 -0.0072065 -0.0061323 0.1882281 -0.1803558 0.0776956 0.0005683 0.3360968 0.0383358 -0.0081092 -0.001687 -0.0029417 -0.1172557 -0.3305859 0.0520818 0.007111 0.0028097 0.0242925 0.0001294 0.0078907 -0.000848 0.0446967 2.1187012 -0.3222777 -0.0405442 -0.1017518 1.2053091 -0.0078496 -0.0432918 -0.0035132 0.0221 0.0945796 0.0555947 0.0006343 0.0092288 -0.0174037 0.001303 0.001061 0.0003717 0.1508403 -0.0300525 -0.1047185 0.0046204 -0.0986405 0.0287366 0.0030884 0.0045597 0.0031952 0.154496 -0.0013348 -0.0042838 0.0655831 0.0015294 0.0792393 0.0843727 0.1181038 0.0535577 -0.0383213 0.0974726 -0.0452281 0.0008395 0.0725941 -0.0896037 0.0005058 -0.0002953 0.0028464 0.118328 -0.0087841 -0.0077299 -0.0666611 -0.0042218 0.0765908 -0.0864165 -0.1193293 -0.0553953 -0.0281726 0.1766399 0.0535797 0.0036064 0.0145104 0.2974001 0.0004158 0.0039576 -0.0003537 0.3800572 0.2334141 -0.0423712 0.0028349 0.0137696 0.3102453 0.0001175 0.0023542 0.0012025 0.3573475 unknown
polarizability: 200.5887475|-0.2401122|134.3151053|-2.9952635|-0.7026706|52.2082447 unknown
InChI: InChI=1S/C8H7ClN4/c1-4-2-3-5-6(11-4)7(10)13-8(9)12-5/h2-3H,10H2,1H3
charge 0 multiplicity 1
20 atoms
Cl 4.074758 -0.836705 -0.091299
N  -1.576007 0.871459 0.008405
N  1.440403 -1.358501 -0.032098
N  2.111316 0.993715 -0.065851
N  0.50627 2.721827 -0.048699
C  -0.274165 0.422772 -0.013508
C  0.104964 -0.957933 -0.008899
C  -2.565846 -0.053703 0.036393
C  -0.953826 -1.918104 0.020742
C  0.810112 1.39502 -0.043428
C  -2.274347 -1.463368 0.043115
C  -3.996959 0.43798 0.060822
C  2.319698 -0.353462 -0.058255
H  -0.699306 -2.982052 0.025054
H  -3.107564 -2.173721 0.066053
H  -4.525421 0.080682 0.964538
H  -4.016857 1.538245 0.050906
H  -4.561688 0.063979 -0.813721
H  1.253318 3.412845 -0.06949
H  -0.481153 2.982125 -0.031178
