program: Gaussian 09
title: 000278385
version: EM64L-G09RevD.01
frameworkgroup: C1[X(C6H10O5)]
method: RPBEPBE
basis: SDD
operation: Freq
keyword: #pfreq=noraman
keyword: PBEPBE/SDD
title: #p freq=noraman PBEPBE/SDD
converged: YES YES NO NO
title: Mulliken charges:
elementType: O O O O O C C C C C C H H H H H H H H H H
charge: -0.450787 -0.457223 -0.499501 -0.190856 -0.152162 -0.122735 -0.122053 -0.132526 -0.726536 0.144124 -0.124205 0.267674 0.256018 0.268482 0.216996 0.245454 0.243900 0.366735 0.371391 0.383643 0.214166
chargesum: 0.00000
title: Mulliken charges with hydrogens summed into heavy atoms:
elementType: O O O O O C C C C C C
charge: -0.084052 -0.085832 -0.115857 -0.190856 -0.152162 0.144939 0.133965 0.135956 -0.020186 0.144124 0.089961
polarizability: 1.03566489e+02 3.13475048e+00 8.58257287e+01 -2.06713231e+00 -1.85166917e+00 6.26033294e+01
1716.lowfreq: -13.6481 -11.8166 -0.0005 0.0000 0.0006 7.6288 46.0321 79.8418 112.6560
frequency: 45.8311 79.8007 112.6040 130.9557 138.6780 168.7090 218.7838 238.2499 265.5984 295.6618 336.6748 370.5450 425.2111 472.2093 488.5089 509.2119 528.6845 564.6251 632.7252 719.0612 768.1320 770.5479 812.0220 866.1513 936.4066 948.1821 987.2521 1004.3652 1050.7670 1096.7853 1127.2296 1157.0249 1196.1531 1237.2139 1243.2615 1281.7942 1302.7735 1327.2623 1332.0398 1358.2508 1382.9577 1394.0264 1406.2371 1467.3748 1485.5400 1588.2343 1612.3825 2953.7280 2984.5088 3000.8645 3038.5715 3058.1538 3080.1547 3098.7028 3379.5238 3408.0430 3413.9041
redmass: 5.7400 7.3641 4.7209 5.5616 3.2735 6.0558 3.3469 1.9822 1.9265 6.5823 5.9758 3.2098 4.1343 1.7941 1.9787 3.1839 1.1686 3.2383 5.6901 1.2688 3.2184 3.8800 3.3429 2.9853 1.9029 2.5059 2.0144 3.2577 2.8057 2.4660 1.7939 1.6492 1.6295 1.3393 1.5761 1.4537 1.3495 1.3398 1.2378 1.3312 1.2646 1.2260 1.1523 1.0577 1.0484 9.0203 8.8918 1.0898 1.0370 1.0822 1.0864 1.0872 1.0984 1.0990 1.0648 1.0646 1.0641
irintensity: 1.1795 3.3308 2.0836 6.4622 8.4573 8.4621 1.6642 3.7616 7.0411 15.9121 23.4848 6.0150 2.2693 91.4297 76.0099 26.0598 45.8906 12.0175 122.0806 191.3961 29.4350 36.0590 6.0424 19.8808 3.8369 55.7051 9.7164 63.8103 135.1686 3.9740 27.3687 25.9336 67.2809 14.6321 23.6061 29.9996 15.2681 12.6463 14.3737 49.3847 28.1805 55.5941 73.6509 11.0327 15.2968 120.4898 57.4546 76.7339 12.9622 8.5059 10.9367 10.0114 33.1564 26.5706 69.0138 56.2587 52.6569
temp: 298.150 k
press: 1.00000 atm
elementType: 8 8 8 8 8 6 6 6 6 6 6 1 1 1 1 1 1 1 1 1 1
symmnumber: 1
zpe: 420480.5 jmol-1
zpe.correction: 0.160153 hartree
zpe.thermalcorrener: 0.172234 hartree
zpe.thermalcorrenthalpy: 0.173178 hartree
zpe.thermalcorrgfe: 0.122098 hartree
zpe.sumelectzpe: -609.832868 hartree
zpe.sumelectthermal: -609.820787 hartree
zpe.sumelectthermalent: -609.819843 hartree
zpe.sumelectthermalfe: -609.870923 hartree
dipole: -0.4502 0.5997 -1.9126
dipole: 2.0543
quadrupole: -67.6084 -67.7488 -67.9977
quadrupole: 3.7958 -1.0562 -0.1965
quadrupole: 0.1766 0.0361 -0.2127 3.7958 -1.0562 -0.1965
hfenergy: -609.9930207 hartree
pointgroup: C01 [X(C6H10O5)]
dipole: -0.1632615 0.1137038 -0.7833633 debye
dipolederiv: -0.4405989 -0.1296539 0.0734474 -0.141909 -0.4080638 0.0302279 -0.233183 0.0215722 -0.8464461 -0.7516536 0.0930536 0.1044199 0.138017 -0.6466134 0.1800554 0.1748793 0.1123932 -0.478019 -0.5068043 0.1551235 -0.0715507 0.201238 -0.6594007 -0.104522 -0.0772375 -0.1576349 -0.5017245 -0.6171342 -0.0427861 0.0306434 -0.4496689 -0.6416716 -0.0205878 0.2411997 0.0496807 -0.2443597 -0.4511679 0.007341 0.046157 0.2457083 -0.6394009 0.0997435 -0.0238351 0.1050088 -0.3189586 0.2180604 0.0746354 0.0826186 0.2662077 0.2548941 0.0020219 0.5563311 0.0395791 0.6202223 0.4706648 -0.0348131 -0.0080749 -0.1411715 0.5013867 -0.1412874 -0.2233881 -0.0933854 0.2798562 -0.5322786 -0.2486431 -0.0462588 -0.5438199 0.3256854 -0.0355156 -0.000327 0.0229774 0.1680548 -0.0694816 -0.0225929 0.0996236 0.0193184 0.0175813 0.0512087 0.0781958 0.0957934 -0.1581436 0.7345879 0.2544299 -0.050163 0.6328436 0.4529019 0.0188854 -0.3710317 -0.1165617 0.127539 0.8494418 -0.0602968 -0.1356942 -0.2637692 0.6685425 -0.1568012 -0.153481 -0.0998014 0.241957 0.017273 0.0635212 -0.0304846 0.0232083 -0.0602919 0.0298176 -0.014783 -0.0006857 0.0191587 -0.0240457 -0.0527546 -0.0470959 -0.016254 -0.0280752 -0.0525535 -0.0358186 -0.0855648 -0.0355491 0.1373408 0.0346213 0.0068323 0.078692 0.0045436 0.0468187 0.0108467 0.0700005 -0.0294203 0.0791464 0.1047207 -0.0306489 0.0709604 -0.0894975 0.0679084 -0.0087737 0.0510518 0.0547326 -0.1465169 -0.0345902 0.0504163 -0.0116583 0.1087607 0.0046163 0.0143779 0.0065555 0.0767146 0.0830039 -0.0622866 -0.0653109 -0.0558926 -0.0210134 -0.1002014 -0.0524986 -0.0625367 -0.0007589 0.360103 0.0741706 -0.0653058 0.0652453 0.2318599 0.0343508 0.0366195 -0.0272022 0.3989144 0.5089278 -0.0212482 -0.0351379 -0.0269582 0.2810384 -0.0182285 -0.047208 -0.0263882 0.2280101 0.2559626 -0.1634257 0.0069936 -0.0208947 0.3226716 0.0282232 0.0216933 0.0831328 0.3208605 -0.1748308 0.011474 0.0845736 -0.0694425 0.0241622 0.0358197 0.107422 0.0120155 0.0773595 unknown
polarizability: 103.6919084|2.6683615|84.588317|-1.9431887|-5.3701608|63.7153221 unknown
InChI: InChI=1S/C6H10O5/c1-3(8)5(10)6(11)4(9)2-7/h2-3,5-6,8,10-11H,1H3
charge 0 multiplicity 1
21 atoms
O  0.482672 0.267074 1.842114
O  2.81253 -0.532403 0.694004
O  0.630849 -1.412366 -0.711701
O  -1.906844 -1.47155 0.102728
O  -2.078386 2.037905 -0.415955
C  0.742203 0.767773 0.497647
C  2.279093 0.773797 0.247017
C  -0.016392 -0.109258 -0.557887
C  2.699014 1.114904 -1.18926
C  -1.465837 -0.313629 -0.146409
C  -2.402511 0.885321 -0.044967
H  0.335993 1.792279 0.439702
H  2.720489 1.496373 0.956648
H  0.008989 0.424271 -1.528917
H  2.299439 2.099277 -1.498337
H  3.799434 1.156057 -1.250602
H  2.348146 0.350864 -1.906091
H  1.239024 -0.354712 2.048467
H  2.369327 -1.216581 0.11079
H  -0.031962 -2.109355 -0.436897
H  -3.405871 0.635458 0.371406
