program: Gaussian 09
title: 000278386
version: EM64L-G09RevD.01
frameworkgroup: C1[X(C9H12N2O4)]
method: RPBEPBE
basis: SDD
operation: Freq
keyword: #p
keyword: freq=noraman
keyword: PBEPBE/SDD
title: #p freq=noraman PBEPBE/SDD
converged: YES YES NO NO
title: Mulliken charges:
elementType: O O O O N N C C C C C C C C C H H H H H H H H H H H H
charge: -0.243013 -0.213821 -0.209902 -0.192545 -0.090405 0.053197 0.242043 -0.171852 -0.732595 -0.702879 -0.691896 0.419366 -0.336463 -0.301567 0.271287 0.258308 0.208928 0.233212 0.254525 0.238944 0.222479 0.221403 0.238143 0.206128 0.232004 0.292269 0.294701
chargesum: 0.00000
title: Mulliken charges with hydrogens summed into heavy atoms:
elementType: O O O O N N C C C C C C C C C
charge: -0.243013 -0.213821 -0.209902 -0.192545 -0.090405 0.053197 0.242043 0.086456 -0.035930 -0.020053 -0.015621 0.419366 -0.044194 -0.006866 0.271287
polarizability: 2.11825281e+02 -6.72344711e+00 1.22107953e+02 -5.50772902e+00 -5.56194535e+00 8.66740616e+01
1716.lowfreq: -7.4658 -2.4750 0.0002 0.0003 0.0007 10.3977 18.2090 50.0846 54.4787
frequency: 18.0495 50.0798 54.4406 81.1566 98.6062 158.2142 180.2717 197.6837 217.5914 239.9626 247.7964 268.8900 280.9192 321.2145 343.5127 362.8966 412.6051 449.7322 470.8820 495.9261 535.3320 567.8500 624.7948 682.6434 687.7560 721.9335 739.2161 760.5767 783.8781 829.1691 847.3180 905.9249 918.6829 923.9257 927.7638 937.2935 952.5307 1016.8230 1017.1028 1023.5737 1073.1437 1131.5882 1139.8586 1169.1579 1199.2853 1216.1185 1241.4379 1249.9188 1259.4369 1338.9627 1359.9005 1373.9945 1375.6629 1392.4499 1401.3799 1452.6123 1466.1352 1469.5682 1474.6846 1486.0715 1497.1419 1500.8029 1571.9680 2983.1783 2985.2226 2992.7198 3077.6329 3083.2148 3089.6144 3093.3749 3096.9598 3099.5547 3100.3266 3243.3248 3260.8598
redmass: 4.7207 4.9764 5.4094 5.3786 6.4518 5.5096 4.9434 1.2393 2.4382 2.4556 1.0335 2.1121 2.2025 2.9191 2.9294 4.6580 2.8878 9.1083 3.3612 3.3629 6.9475 5.6737 5.2014 9.0434 8.5444 6.1018 10.2669 4.7228 4.5194 1.3324 4.1903 1.3863 5.8899 1.6293 1.6391 6.0798 1.2100 1.2866 1.4010 1.3875 1.2806 5.4219 6.5297 2.4106 2.3128 1.8780 3.2351 3.1036 6.0721 4.1657 7.2090 1.2499 1.2034 1.9164 1.2036 1.0495 1.0478 1.0514 1.0597 1.0556 1.0826 7.2043 7.0207 1.0357 1.0353 1.0353 1.0997 1.0992 1.1002 1.1004 1.0996 1.0999 1.0874 1.0953 1.1045
irintensity: 3.9197 0.9347 0.9212 5.2322 2.4368 2.4449 0.2540 0.3110 0.8576 4.1331 0.2253 1.2942 2.1626 0.8869 0.3512 8.2246 0.3539 8.9570 2.5709 5.3474 0.6885 0.9252 3.4627 12.9307 1.0628 16.9365 17.5059 27.7482 24.8597 51.3807 5.8899 1.0970 3.2249 2.1404 1.7032 10.7097 0.2320 28.5388 5.1716 1.2994 2.2687 7.0499 59.9450 12.3553 83.6970 197.0820 5.9210 22.7137 206.5282 8.3136 142.1422 45.7005 25.6810 4.0279 10.5121 0.9651 0.6307 4.3049 16.6555 11.8589 37.8283 82.6058 2.4270 15.7314 22.0359 19.2364 7.4456 46.1823 1.1726 4.6888 37.1780 39.2287 9.4269 0.2163 5.6502
temp: 298.150 k
press: 1.00000 atm
elementType: 8 8 8 8 7 7 6 6 6 6 6 6 6 6 6 1 1 1 1 1 1 1 1 1 1 1 1
symmnumber: 1
zpe: 534143.3 jmol-1
zpe.correction: 0.203444 hartree
zpe.thermalcorrener: 0.218633 hartree
zpe.thermalcorrenthalpy: 0.219577 hartree
zpe.thermalcorrgfe: 0.159849 hartree
zpe.sumelectzpe: -759.214795 hartree
zpe.sumelectthermal: -759.199606 hartree
zpe.sumelectthermalent: -759.198662 hartree
zpe.sumelectthermalfe: -759.258391 hartree
dipole: 5.6183 -1.1712 1.5205
dipole: 5.9371
quadrupole: -103.5515 -87.2008 -89.7364
quadrupole: 14.2798 3.7041 -1.5945
quadrupole: -10.0553 6.2954 3.7598 14.2798 3.7041 -1.5945
hfenergy: -759.4182394 hartree
pointgroup: C01 [X(C9H12N2O4)]
dipole: -2.2083264 -0.151773 -0.7458752 debye
polarizability: 212.140978|6.2444891|112.6340351|-1.3066163|16.5860828|95.8322825 unknown
InChI: InChI=1S/C9H12N2O4/c1-9(2,3)10-8(15-10)6-4-5-7(14-6)11(12)13/h4-5,8H,1-3H3
charge 0 multiplicity 1
27 atoms
O  -1.822075 -1.154757 1.229287
O  1.436244 0.375835 0.571899
O  4.873868 -0.11246 -0.3160
O  3.869754 1.524138 0.951381
N  -2.127092 -0.459055 -0.170982
N  3.840904 0.452461 0.231438
C  -3.376149 0.424548 -0.099062
C  -0.966903 -0.069295 0.670597
C  -3.510969 1.289986 1.175062
C  -3.251798 1.30229 -1.370768
C  -4.561117 -0.560177 -0.215765
C  0.3638 -0.445592 0.167907
C  0.835964 -1.488566 -0.62831
C  2.257135 -1.327233 -0.740107
C  2.5771 -0.191273 -0.002923
H  -0.99428 0.868687 1.242181
H  -2.805985 2.141451 1.185313
H  -4.530695 1.710571 1.220089
H  -3.35531 0.677812 2.081273
H  -3.14021 0.674774 -2.271894
H  -2.385987 1.986879 -1.309163
H  -4.164481 1.914305 -1.482718
H  -4.629623 -1.188555 0.689404
H  -5.508619 -0.004988 -0.333351
H  -4.42858 -1.222919 -1.08825
H  0.217044 -2.266956 -1.067327
H  2.964761 -1.947707 -1.283413
