program: Gaussian 09
title: 000278464
version: EM64L-G09RevD.01
frameworkgroup: C1[X(C19H29NO)]
method: RPBEPBE
basis: SDD
operation: Freq
keyword: #p
keyword: freq=noraman
keyword: PBEPBE/SDD
title: #p freq=noraman PBEPBE/SDD
converged: YES YES NO NO
title: Mulliken charges:
elementType: O N C C C C C C C C C C C C C C C C C C C H H H H H H H H H H H H H H H H H H H H H H H H H H H H H
charge: -0.276128 -0.354707 -0.035380 0.326161 -0.451643 -0.487576 -0.469578 -0.418137 -0.410738 -0.562257 -0.384363 0.386899 -0.411536 -0.379951 -0.387565 -0.710221 -0.271421 -0.271168 0.244422 -0.246600 -0.778951 0.174171 0.196228 0.220703 0.231851 0.203587 0.182299 0.206337 0.200052 0.189129 0.183876 0.199841 0.224301 0.280108 0.199547 0.194202 0.268722 0.221747 0.296111 0.213539 0.238776 0.198309 0.210893 0.221370 0.223828 0.225345 0.228736 0.253491 0.208935 0.254404
chargesum: 0.00000
title: Mulliken charges with hydrogens summed into heavy atoms:
elementType: O N C C C C C C C C C C C C C C C C C C C
charge: -0.276128 -0.058595 0.138790 0.326161 -0.034712 -0.052138 -0.080942 -0.028956 -0.027020 -0.057848 0.009386 0.386899 0.078933 -0.166412 -0.148790 -0.079649 -0.047593 -0.045823 0.244422 -0.017864 -0.062121
polarizability: 2.29804552e+02 1.93738024e+01 2.08860211e+02 8.88178518e+00 -3.24177298e+00 1.87252755e+02
1716.lowfreq: -15.6398 -7.7685 -0.0006 0.0003 0.0003 2.8159 24.4689 32.5977 51.2557
frequency: 24.0123 32.3350 51.2235 62.3044 63.2639 65.7655 66.6426 78.0753 101.4415 128.3977 147.9554 171.8139 201.2112 216.2741 228.8518 241.3943 262.6584 272.3550 284.8847 294.4175 319.4071 335.8843 371.6137 403.2212 429.4774 430.9634 448.7228 452.9908 496.5986 510.5364 534.2207 590.0790 601.7946 616.7746 619.6767 641.0088 704.1741 712.5519 750.0070 772.9287 787.0898 794.2071 833.2470 839.6672 851.6637 854.2191 875.0051 895.1092 908.6283 915.1020 917.8494 927.3851 947.3801 976.2784 977.4996 991.2929 994.0382 1005.1171 1030.0683 1038.7461 1040.6698 1051.7146 1055.6397 1060.9432 1075.0266 1084.3825 1094.8994 1098.9464 1112.9036 1124.8497 1133.9289 1143.7435 1174.3066 1187.9845 1191.3647 1203.3172 1234.9488 1244.7469 1256.3815 1259.3534 1263.1011 1274.2003 1292.4614 1292.7494 1307.3126 1317.1285 1325.0457 1330.2707 1336.5233 1337.3625 1343.5944 1355.8108 1362.0428 1364.3307 1374.3646 1386.2620 1388.5802 1432.4125 1449.6607 1461.8377 1462.5335 1463.7920 1466.7482 1470.8308 1472.8670 1474.7279 1476.0583 1478.9080 1482.7806 1486.1904 1497.4088 1500.8659 1584.9420 1610.4445 1619.1681 2913.5829 2955.3872 2960.5088 2964.2045 2966.2498 2968.9226 2974.1495 2981.2360 2990.4901 2994.9643 3015.6280 3018.2302 3023.6671 3025.4550 3026.2517 3036.2832 3040.3690 3047.8261 3067.5698 3071.0641 3089.9401 3096.6612 3098.2797 3120.6847 3128.7784 3147.0040 3153.5468 3165.3860 3551.0241
redmass: 4.2182 3.4071 2.7347 3.7882 3.0097 3.0344 2.1866 1.6409 3.1296 2.0213 2.4488 5.7218 3.3780 1.9916 1.4233 3.1626 3.2449 2.9757 3.7501 3.3410 2.0649 2.2183 2.1673 2.8145 2.7832 2.6845 2.7404 2.9149 1.9783 2.7493 1.5100 2.8221 2.3201 4.1123 4.8015 3.0717 1.6449 3.0577 1.2513 2.1322 1.4595 2.1557 2.1777 2.0948 1.3051 1.6801 2.3204 1.5080 2.0023 1.5649 2.0309 1.8583 2.2371 1.4033 1.6586 5.5745 1.3149 2.2644 2.5705 2.2046 1.9024 1.6739 1.6941 1.3779 2.4453 1.7019 2.9293 1.8397 2.4596 2.6705 2.3253 1.9861 1.0598 2.2474 1.6870 1.1394 1.3768 1.6375 1.3485 1.2989 1.3402 1.3618 1.3091 1.2364 1.2578 1.2638 1.4167 1.3374 1.3748 1.4534 1.5169 1.4604 1.4457 1.7663 2.3999 1.2127 1.2283 2.2592 1.0455 1.1120 1.0922 1.0981 1.1183 1.0938 1.1042 1.1374 1.0673 1.1499 1.1589 1.6047 1.2171 1.3308 5.6826 6.0275 6.0277 1.0815 1.0622 1.0627 1.0608 1.0364 1.0631 1.0600 1.0614 1.0604 1.0361 1.0954 1.0970 1.0752 1.0942 1.0898 1.1025 1.1007 1.1018 1.1023 1.0988 1.0988 1.1004 1.0980 1.0843 1.0881 1.0919 1.0941 1.1002 1.0772
irintensity: 5.3460 0.2113 0.5787 0.4170 1.0027 9.3099 0.3389 0.6152 0.2212 1.4528 0.4826 3.3794 4.2314 0.0480 0.1915 1.4831 0.3913 1.0438 0.3194 0.4543 0.0349 0.3336 1.4881 0.0454 0.1937 0.8894 1.3973 15.2677 1.8188 16.3372 72.6676 3.4593 8.8879 4.5885 4.0732 8.0231 53.4799 6.9371 18.7340 25.2601 0.0600 3.8551 5.4495 3.6858 0.9214 6.8454 3.9762 8.0598 4.6330 0.1744 0.1632 0.2602 10.4088 0.6008 1.7075 0.6916 0.3808 11.1061 10.6163 5.3723 8.3144 0.5362 1.0587 1.1624 0.7453 6.6866 4.0769 4.7892 1.0660 20.1602 1.0951 1.8458 0.0951 0.3313 0.2281 0.1939 0.5299 23.6641 5.3235 1.3651 25.4564 79.0104 10.3760 0.5751 4.7082 6.4772 3.9795 0.3504 0.6331 6.3214 1.0910 1.4460 0.7069 4.6541 2.6032 10.8278 64.7071 6.4420 13.8207 9.8503 14.5854 12.5068 78.0587 6.2291 30.9852 41.9004 4.6688 72.0615 32.9545 42.2809 22.3035 60.6339 2.4627 8.4782 172.6315 31.9722 32.7153 49.6829 26.6318 39.7251 30.0613 23.5439 18.1616 35.8402 12.8484 7.5456 78.1098 67.8748 81.0026 2.7213 50.1510 9.6868 76.9805 64.2361 46.5460 3.7509 22.6782 8.2259 2.4246 4.4365 34.2782 43.1031 11.3064 11.6225
temp: 298.150 k
press: 1.00000 atm
elementType: 8 7 6 6 6 6 6 6 6 6 6 6 6 6 6 6 6 6 6 6 6 1 1 1 1 1 1 1 1 1 1 1 1 1 1 1 1 1 1 1 1 1 1 1 1 1 1 1 1 1
symmnumber: 1
zpe: 1154780.5 jmol-1
zpe.correction: 0.439833 hartree
zpe.thermalcorrener: 0.461885 hartree
zpe.thermalcorrenthalpy: 0.462829 hartree
zpe.thermalcorrgfe: 0.387741 hartree
zpe.sumelectzpe: -869.787407 hartree
zpe.sumelectthermal: -869.765354 hartree
zpe.sumelectthermalent: -869.764410 hartree
zpe.sumelectthermalfe: -869.839499 hartree
dipole: -1.9847 3.6477 0.2710
dipole: 4.1615
quadrupole: -135.1531 -128.1324 -125.8154
quadrupole: 16.1066 3.3075 -3.7817
quadrupole: -5.4528 1.5679 3.8849 16.1066 3.3075 -3.7817
hfenergy: -870.2272395 hartree
pointgroup: C01 [X(C19H29N1O1)]
dipole: 0.7601591 -1.4501084 -0.0035009 debye
polarizability: 230.1225759|19.6911403|207.7520314|-8.1499371|4.473544|188.0429097 unknown
InChI: InChI=1S/C19H29NO/c1-3-14-19(15-20-16(2)21,17-10-6-4-7-11-17)18-12-8-5-9-13-18/h4,6-7,10-11,18,20H,3,5,8-9,12-15H2,1-2H3
charge 0 multiplicity 1
50 atoms
O  -3.995408 0.961202 -0.73643
N  -2.37604 -0.712017 -0.875059
C  0.335671 -1.348216 0.300505
C  -0.172728 0.151919 0.089998
C  1.456545 -1.491657 1.368769
C  0.797367 -2.064214 -0.99995
C  -0.895303 0.60688 1.404148
C  1.809959 -2.974703 1.638512
C  1.150849 -3.551252 -0.745957
C  -1.230108 0.190048 -1.072801
C  2.237115 -3.699363 0.342642
C  1.021551 1.072682 -0.270702
C  -1.501767 2.031815 1.411297
C  1.481936 1.230468 -1.607729
C  1.74966 1.757197 0.742305
C  -2.028628 2.415647 2.811733
C  2.603048 2.033103 -1.917992
C  2.87154 2.558575 0.440954
C  -3.68393 -0.269666 -0.739918
C  3.307518 2.704557 -0.89532
C  -4.736052 -1.368336 -0.597928
H  -0.547398 -1.904813 0.693117
H  1.154665 -1.013425 2.318892
H  2.363394 -0.96106 1.016608
H  1.687829 -1.542441 -1.404649
H  0.018561 -2.015067 -1.786585
H  -0.203468 0.517272 2.263398
H  -1.708208 -0.120808 1.602981
H  2.616806 -3.034059 2.394856
H  0.92735 -3.490628 2.072061
H  0.237566 -4.094604 -0.421936
H  1.484766 -4.023626 -1.690554
H  -0.759375 -0.06668 -2.037018
H  -1.641747 1.207777 -1.171042
H  2.436664 -4.769661 0.544865
H  3.185786 -3.25852 -0.027205
H  -2.33524 2.090231 0.687477
H  -0.740929 2.769345 1.091273
H  -2.20244 -1.71776 -0.895848
H  0.968436 0.731371 -2.435357
H  1.438644 1.668434 1.787665
H  -1.215231 2.418082 3.563394
H  -2.800896 1.700816 3.154832
H  -2.485245 3.422243 2.804594
H  2.922619 2.132554 -2.961815
H  3.40279 3.070712 1.25155
H  4.175357 3.329486 -1.133795
H  -5.280508 -1.224386 0.35117
H  -4.31859 -2.390396 -0.618683
H  -5.472549 -1.267252 -1.413725
