program: Gaussian 09
title: 000278376
version: EM64L-G09RevD.01
frameworkgroup: C1[X(C15H10ClN)]
method: RPBEPBE
basis: SDD
operation: Freq
keyword: #p
keyword: freq=noraman
keyword: PBEPBE/SDD
title: #p freq=noraman PBEPBE/SDD
converged: NO YES NO NO
title: Mulliken charges:
elementType: Cl N C C C C C C C C C C C C C C C H H H H H H H H H H
charge: -0.044499 0.005645 0.454291 -0.047522 -0.108075 0.335372 -0.179478 -0.284172 -0.355124 -0.316731 -0.379231 -0.379238 -0.240013 -0.221362 -0.221719 -0.221725 -0.236115 0.274740 0.254684 0.268784 0.242495 0.242491 0.233719 0.235780 0.228507 0.228507 0.229990
chargesum: 0.00000
title: Mulliken charges with hydrogens summed into heavy atoms:
elementType: Cl N C C C C C C C C C C C C C C C
charge: -0.044499 0.005645 0.454291 -0.047522 -0.108075 0.335372 -0.179478 -0.009432 -0.100440 -0.047947 -0.136736 -0.136747 -0.006295 0.014419 0.006788 0.006782 -0.006126
polarizability: 2.69003750e+02 -1.28673932e+01 1.63710561e+02 5.03902323e-04 9.13341213e-03 1.08455190e+02
1716.lowfreq: -56.3622 -7.0884 -6.5384 0.0011 0.0017 0.0019 7.9189 52.8526 63.6304
frequency: -56.3574 52.8473 63.6274 109.3438 167.4013 186.1957 207.5382 241.7735 259.2085 345.4676 367.9472 394.2328 420.1710 437.5783 512.9417 533.6799 556.1971 567.5422 587.1661 613.3635 644.9898 702.2342 702.5114 712.1726 765.8161 777.4295 787.8578 809.7715 851.0939 853.3740 883.4399 885.2353 923.2533 945.7309 971.9246 973.8926 988.3907 995.9717 999.4325 1018.4414 1023.8622 1064.1926 1078.3062 1125.9042 1162.7713 1172.9056 1186.5000 1188.0278 1244.8766 1277.7438 1283.3000 1311.9302 1347.7829 1370.6039 1372.6569 1395.5475 1427.9475 1449.1903 1476.2462 1491.1214 1539.1897 1579.7703 1585.8513 1613.3475 1622.1988 3123.7430 3129.9034 3135.4721 3140.9991 3149.1363 3150.7496 3164.1427 3165.1418 3174.7141 3178.9274
redmass: 3.9955 5.0316 5.8472 5.3091 4.6169 9.8202 5.7309 4.7482 7.0105 5.2296 11.2050 2.8111 3.3654 4.4933 7.1485 3.5618 6.5989 4.1253 4.8631 6.1292 6.7852 1.8550 4.4335 4.5449 2.1612 1.3400 3.1488 5.6995 1.2470 5.9940 1.4237 1.6744 1.4499 6.1583 1.3578 1.3893 6.1020 1.3235 1.3278 2.6108 2.2951 2.4427 1.6061 1.7796 1.2069 1.0527 1.4903 1.1161 1.8261 2.6636 3.9561 1.3568 5.0670 7.1806 3.2939 3.1364 2.1949 2.8072 3.2379 3.0040 7.0776 8.2369 6.0424 6.2757 6.6815 1.0845 1.0878 1.0858 1.0926 1.0896 1.0969 1.0956 1.1018 1.0998 1.0939
irintensity: 0.0081 0.7801 0.7641 0.2644 3.9009 0.7125 0.4036 0.3446 1.0031 0.4064 4.3523 0.0225 5.2468 4.5055 1.0667 1.5279 10.2925 5.3462 0.9879 0.1712 23.2267 36.1484 0.4292 37.0661 53.7589 87.7582 5.4191 23.2679 0.0108 9.4470 12.5667 6.1464 0.7455 16.5457 2.4417 0.0220 2.4413 0.0860 0.0623 0.7811 21.3872 4.9612 8.4017 2.0343 7.9011 0.0218 5.6813 2.6663 3.0946 1.0467 14.1600 0.5439 27.4894 0.0049 6.3077 80.0203 8.2113 8.2096 77.8231 4.0469 39.2079 104.1760 1.2150 0.3415 9.8827 1.4027 0.1807 3.3918 17.5544 7.1266 36.4384 13.6474 25.9549 21.4648 0.0119
temp: 298.150 k
press: 1.00000 atm
elementType: 17 7 6 6 6 6 6 6 6 6 6 6 6 6 6 6 6 1 1 1 1 1 1 1 1 1 1
symmnumber: 1
zpe: 530674.8 jmol-1
zpe.correction: 0.202123 hartree
zpe.thermalcorrener: 0.214388 hartree
zpe.thermalcorrenthalpy: 0.215333 hartree
zpe.thermalcorrgfe: 0.162671 hartree
zpe.sumelectzpe: -1091.268654 hartree
zpe.sumelectthermal: -1091.256389 hartree
zpe.sumelectthermalent: -1091.255444 hartree
zpe.sumelectthermalfe: -1091.308106 hartree
dipole: 0.3680 -0.1050 -0.0001
dipole: 0.3827
quadrupole: -85.2004 -106.5878 -102.2701
quadrupole: -6.9186 0.0006 0.0036
quadrupole: 12.8190 -8.5684 -4.2507 -6.9186 0.0006 0.0036
hfenergy: -1091.4707769 hartree
pointgroup: C01 [X(C15H10Cl1N1)]
dipole: -0.1474442 0.0304171 -0.0000517 debye
polarizability: 270.3315861|-4.8984144|162.3826873|0.0078971|-0.0459212|108.4552281 unknown
InChI: InChI=1S/C15H10ClN/c16-13-10-15(11-6-2-1-3-7-11)17-14-9-5-4-8-12(13)14/h1-10H
charge 0 multiplicity 1
27 atoms
Cl -2.054592 -3.288726 0.002054
N  -0.193958 0.988647 -0.000457
C  -2.231074 -0.469297 0.000366
C  0.5752 -0.119892 0.00023
C  -1.5744 0.829311 -0.000395
C  2.069184 0.046774 0.000153
C  -1.355797 -1.602584 0.00107
C  0.025407 -1.451299 0.001016
C  -3.659795 -0.534515 0.000364
C  -2.383856 2.009855 -0.001124
C  2.781963 0.116713 -1.222958
C  2.782024 0.117349 1.223192
C  -4.417935 0.63912 -0.000359
C  -3.777721 1.91866 -0.001106
C  4.188089 0.259868 -1.222713
C  4.18815 0.260508 1.222804
C  4.894933 0.331146 0.00001
H  0.69563 -2.313899 0.001549
H  -4.146927 -1.514645 0.000939
H  -1.863406 2.972251 -0.00169
H  2.234799 0.068752 -2.171333
H  2.234906 0.069882 2.17162
H  -5.511782 0.58143 -0.000355
H  -4.386821 2.828965 -0.001666
H  4.728887 0.31738 -2.173994
H  4.728993 0.318521 2.174029
H  5.985102 0.442424 -0.000047
