program: Gaussian 09
title: 000278406
version: EM64L-G09RevD.01
frameworkgroup: C1[X(C12H17N5O4)]
method: RPBEPBE
basis: SDD
operation: Freq
keyword: #p
keyword: freq=noraman
keyword: PBEPBE/SDD
title: #p freq=noraman PBEPBE/SDD
converged: YES YES NO NO
title: Mulliken charges:
elementType: O O O O N N N N N C C C C C C C C C C C C H H H H H H H H H H H H H H H H H
charge: -0.284944 -0.437862 -0.505850 -0.484339 -0.171557 -0.095493 -0.035484 -0.065149 -0.613048 -0.122465 -0.040989 -0.189023 -0.099731 -0.036827 -0.783335 -0.387069 0.120664 -0.242374 -0.099044 0.155856 -0.372422 0.292589 0.228735 0.253862 0.294948 0.221818 0.242283 0.226169 0.222730 0.203470 0.255375 0.351092 0.344356 0.376550 0.364261 0.240989 0.341987 0.329270
chargesum: 0.00000
title: Mulliken charges with hydrogens summed into heavy atoms:
elementType: O O O O N N N N N C C C C C C C C C C C C
charge: -0.284944 -0.086770 -0.129300 -0.120078 -0.171557 -0.095493 -0.035484 -0.065149 0.058208 0.170124 0.187746 0.064839 0.195217 0.184991 -0.092153 0.071776 0.120664 0.101982 -0.099044 0.155856 -0.131433
polarizability: 2.34837343e+02 -7.12038601e+00 1.70891044e+02 -2.63085309e+00 -1.94209890e+01 1.26249399e+02
1716.lowfreq: -8.4297 -0.0004 -0.0003 0.0008 2.8410 9.8970 23.8577 42.5720 58.4285
frequency: 23.6713 42.5240 58.4123 75.6180 89.6916 96.6393 123.5918 138.9287 151.9927 196.4528 219.8160 229.4632 239.9774 245.0636 259.6500 266.6745 275.5816 286.0177 289.5100 303.1236 341.4492 381.7890 409.5452 486.3833 499.3978 509.6493 524.8483 542.1696 545.4715 551.7655 567.3220 613.5087 622.9132 649.6705 669.2968 689.7079 710.5054 746.6201 787.3875 796.3550 800.6282 852.7354 853.3403 875.5166 907.8271 910.7205 926.4882 942.8486 960.5901 964.4982 975.5028 999.9392 1012.8560 1032.3874 1038.6681 1078.8217 1093.7682 1110.6954 1131.7498 1157.7356 1169.5987 1188.2470 1194.8927 1199.2781 1228.9284 1232.8848 1250.6937 1261.9325 1268.6016 1285.4759 1299.4724 1312.1286 1314.6041 1317.5858 1336.5674 1353.2216 1358.5223 1363.5417 1379.4894 1381.9462 1388.8472 1399.0317 1407.0402 1433.8221 1464.8732 1466.5664 1480.2263 1489.8680 1540.6451 1577.4232 1630.0122 2947.4884 2979.3712 2981.0043 2988.7368 3012.6329 3027.1665 3061.5951 3069.4560 3071.9795 3079.5762 3163.5942 3180.8409 3486.4832 3541.8867 3583.9458 3603.4274 3697.9364
redmass: 5.7265 5.8319 5.1300 5.3139 3.1202 4.9741 4.5729 5.2646 5.2864 6.2703 1.6419 1.6690 3.9749 4.3343 4.0100 2.6037 4.6846 1.9867 1.2854 2.8568 3.9329 5.4951 3.7608 2.1326 1.2305 8.6723 3.4651 1.2059 1.1405 4.0297 4.0600 5.4460 6.8933 6.3482 8.6802 7.0099 4.0768 6.0581 5.2928 4.4659 8.0347 3.3072 7.0276 2.8323 1.3487 2.1984 1.4277 2.6958 2.3599 3.5329 3.5660 2.5540 2.3969 2.9969 2.1331 2.0535 2.7775 2.6500 3.9928 2.1723 1.2506 1.1386 2.2128 1.3738 2.1522 1.2834 1.2429 2.8335 1.5310 1.2756 5.7447 1.2916 3.1229 1.4154 1.3487 1.7790 1.3836 1.9268 1.5857 2.8513 1.4249 1.2660 1.7633 2.8101 3.5397 1.0805 1.0449 1.0516 7.3451 1.8977 2.7505 1.0828 1.0379 1.0618 1.0789 1.0861 1.0858 1.1063 1.0877 1.0990 1.0987 1.0919 1.1040 1.0646 1.0441 1.0664 1.0670 1.1056
irintensity: 0.1223 1.3288 0.5686 0.8459 7.8422 10.9274 4.1361 6.8414 2.7098 0.9553 5.8989 13.0667 24.7754 33.9817 7.6580 46.5833 15.4222 18.7540 117.8730 28.9753 22.8098 1.2043 1.4581 46.4962 272.9033 3.3412 8.2589 65.3585 61.5759 12.1670 0.2147 6.4900 4.7008 47.8190 1.3764 7.6947 48.0368 17.6986 30.2444 25.0861 24.9850 20.4035 6.7136 9.4572 24.2549 54.3563 10.5445 27.6532 21.0601 75.1159 95.1220 39.3794 65.2198 6.9488 24.2573 41.3203 76.4216 5.6736 34.7016 10.2098 38.1274 31.6581 19.9153 13.2590 139.8180 42.3673 34.3581 23.3053 15.9483 9.7343 67.5279 2.2011 25.3417 10.7419 5.8721 43.5900 6.8339 28.9808 12.0260 15.7218 5.6372 15.1555 18.4034 63.6753 24.9975 10.6497 13.9919 9.0894 69.3040 37.6498 607.2314 37.5480 23.6193 24.6989 78.9118 15.4736 22.8083 35.9003 1.3654 34.1541 20.9820 19.8033 109.2808 46.7187 115.5587 8.6477 11.8624 47.3976
temp: 298.150 k
press: 1.00000 atm
elementType: 8 8 8 8 7 7 7 7 7 6 6 6 6 6 6 6 6 6 6 6 6 1 1 1 1 1 1 1 1 1 1 1 1 1 1 1 1 1
symmnumber: 1
zpe: 785579.1 jmol-1
zpe.correction: 0.299211 hartree
zpe.thermalcorrener: 0.318988 hartree
zpe.thermalcorrenthalpy: 0.319933 hartree
zpe.thermalcorrgfe: 0.250828 hartree
zpe.sumelectzpe: -1040.529679 hartree
zpe.sumelectthermal: -1040.509902 hartree
zpe.sumelectthermalent: -1040.508958 hartree
zpe.sumelectthermalfe: -1040.578063 hartree
dipole: -4.4866 -0.8164 1.4128
dipole: 4.7741
quadrupole: -114.0285 -109.9546 -123.1165
quadrupole: -8.9285 9.7725 12.3146
quadrupole: 1.6714 5.7453 -7.4166 -8.9285 9.7725 12.3146
hfenergy: -1040.8288907 hartree
pointgroup: C01 [X(C12H17N5O4)]
dipole: 1.7804542 -0.2578555 -0.5398679 debye
polarizability: 234.0685438|9.8567591|172.9650355|-3.420574|17.7070039|124.9442063 unknown
InChI: InChI=1S/C12H17N5O4/c1-5-8(20)12(21-9(5)6(19)2-18)17-4-16-7-10(13)14-3-15-11(7)17/h3-6,8-9,12,18-20H,2,13H2,1H3
charge 0 multiplicity 1
38 atoms
O  1.595034 0.338548 1.126075
O  1.304285 3.278733 0.254476
O  2.829794 -1.498715 -0.933456
O  4.452638 -2.706805 0.845293
N  -0.570456 0.121686 0.121636
N  -1.495782 -1.722643 -0.884326
N  -2.646492 1.213226 0.957758
N  -4.659679 -0.076851 0.370553
N  -4.579805 -2.100296 -0.851016
C  2.224961 1.313121 -1.007205
C  2.782411 0.635031 0.268516
C  0.967802 2.039806 -0.461142
C  0.432779 1.075668 0.628125
C  3.568397 -0.656472 0.018232
C  3.233269 2.22214 -1.729185
C  3.817676 -1.452338 1.307656
C  -1.95444 0.231051 0.310746
C  -0.35159 -1.07086 -0.596315
C  -2.505445 -0.914986 -0.323959
C  -3.92406 -1.043856 -0.275272
C  -3.992619 0.974355 0.941445
H  1.889931 0.517375 -1.698541
H  3.424619 1.34537 0.828823
H  0.208822 2.227506 -1.244539
H  -0.037973 1.64569 1.446596
H  4.550191 -0.379756 -0.426654
H  4.08328 1.632933 -2.11672
H  2.76762 2.726612 -2.596377
H  3.640926 2.994586 -1.051169
H  4.491668 -0.892915 1.98634
H  2.853042 -1.65087 1.810308
H  1.547813 3.977886 -0.401527
H  0.657584 -1.40972 -0.835753
H  3.227203 -2.408214 -0.850892
H  4.453333 -3.37637 1.571683
H  -4.620001 1.715126 1.44624
H  -4.047954 -2.825707 -1.326814
H  -5.594083 -2.147676 -0.784438
