program: Gaussian 09
title: 000278434
version: EM64L-G09RevD.01
frameworkgroup: C1[X(C13H22O4)]
method: RPBEPBE
basis: SDD
operation: Freq
keyword: #pfreq=noraman
keyword: PBEPBE/SDD
title: #p freq=noraman PBEPBE/SDD
converged: YES YES NO NO
title: Mulliken charges:
elementType: O O O O C C C C C C C C C C C C C H H H H H H H H H H H H H H H H H H H H H H
charge: -0.265083 -0.271923 -0.213098 -0.235591 -0.005831 -0.423972 0.394369 0.188835 0.226371 -0.731766 -0.849340 -0.270898 -0.753873 -0.266917 -0.260090 -0.665451 -0.665916 0.232561 0.223317 0.212084 0.238807 0.228421 0.214934 0.276290 0.242851 0.220998 0.223394 0.226840 0.224224 0.222273 0.233431 0.220389 0.234455 0.256131 0.222523 0.217391 0.215205 0.222876 0.260778
chargesum: 0.00000
title: Mulliken charges with hydrogens summed into heavy atoms:
elementType: O O O O C C C C C C C C C C C C C
charge: -0.265083 -0.271923 -0.213098 -0.235591 -0.005831 0.031906 0.394369 0.188835 0.226371 -0.052454 -0.115265 -0.049900 -0.079414 0.188787 0.194754 0.030594 0.032943
polarizability: 1.68110240e+02 -3.35997825e+00 1.63311644e+02 5.25585862e+00 8.08494098e+00 1.35629390e+02
1716.lowfreq: -13.7220 -6.8065 -3.9476 -0.0008 0.0003 0.0005 31.5826 37.5971 44.5555
frequency: 31.4356 37.3588 44.5160 54.1668 67.3235 91.6966 94.9833 102.2420 113.9079 122.4061 138.2553 160.9638 169.7804 180.3383 203.8305 211.6796 221.4865 246.3417 268.4002 271.3546 295.9419 317.0575 330.5789 355.4989 364.0696 386.6697 418.8685 444.0108 488.4469 518.7184 597.6942 657.5219 692.2035 710.1776 733.1631 757.3966 802.8004 812.9517 816.2784 835.4638 838.0938 869.8638 932.5277 948.5853 979.0437 1010.9441 1014.6569 1020.6966 1038.9566 1051.3817 1061.6630 1080.4518 1090.3303 1096.3479 1097.2195 1127.4778 1150.9027 1155.4086 1158.3197 1187.5277 1199.0636 1276.1010 1279.9264 1295.5940 1325.1777 1352.2245 1355.1986 1356.3315 1390.6547 1391.3356 1392.5555 1393.5689 1402.2776 1455.0663 1455.4920 1460.7716 1461.9091 1462.6801 1464.5643 1468.0025 1472.2680 1477.6661 1480.0901 1484.8059 1485.1420 1493.0593 1609.1675 1641.1071 1680.2846 2967.4230 2982.1723 2987.5298 2992.3440 2992.5911 3014.3214 3026.2328 3029.1496 3034.2662 3061.3951 3069.8292 3082.4979 3086.0906 3086.4891 3091.3836 3092.4924 3094.1705 3098.0491 3098.9425 3117.9421 3119.0834 3124.3250
redmass: 3.8769 3.5460 3.2122 2.8758 2.6670 3.5034 1.1648 3.6127 1.9299 1.8934 2.3134 2.3731 1.8776 2.3208 1.6566 1.4553 1.4282 2.4943 2.5590 3.8791 2.7023 2.5410 3.1840 3.7069 3.4428 4.6799 3.2799 3.3760 3.2143 3.5771 3.9805 3.3930 3.6695 4.9578 3.1635 2.2862 1.4312 1.3295 1.4399 3.5445 1.3743 3.4625 2.2756 1.8999 1.9218 2.7181 2.6467 2.1627 1.4958 1.5419 2.4789 2.1823 3.6586 2.1559 2.1817 3.5131 3.4362 1.6669 1.9559 2.8082 3.2093 1.1185 1.1152 1.2603 1.3946 1.2728 1.2675 1.3000 1.2231 1.2577 1.2582 1.2128 1.2164 1.0976 1.0906 1.0688 1.0474 1.0661 1.0443 1.0513 1.0494 1.0462 1.0492 1.0522 1.0509 1.0699 9.7001 9.8815 6.4372 1.0386 1.0375 1.0359 1.0361 1.0361 1.0605 1.0596 1.0592 1.0967 1.0971 1.1000 1.0990 1.0977 1.0979 1.0966 1.1030 1.1031 1.0960 1.1011 1.1055 1.1058 1.0895
irintensity: 1.9676 0.8046 0.1202 1.5218 0.7793 0.3158 0.1653 0.0142 0.6505 0.5721 0.0913 2.0040 1.9908 0.6579 0.6710 3.2332 0.7576 1.6787 1.8041 3.2122 1.2219 12.0396 9.7665 5.8775 1.0470 2.9800 2.9569 1.4856 4.2705 12.3801 1.3849 4.4673 2.7411 5.2386 17.4727 5.5879 14.5093 4.1319 8.9134 3.0235 10.7326 2.3835 61.6071 2.1748 8.4582 19.1835 99.1261 39.3772 2.7348 11.0377 492.6572 45.7821 2.5951 2.9671 9.0115 4.9443 28.4899 27.2715 14.7523 36.3989 139.6404 2.8066 1.8517 24.6458 2.1668 0.5223 1.1703 1.5732 8.6465 6.2644 20.7718 35.1248 36.6895 18.8122 1.5141 14.9611 10.7427 4.6063 12.1878 17.2153 22.0308 5.0115 5.6896 15.0463 19.5321 12.3855 74.0175 193.2774 8.8908 44.2768 25.8357 29.0865 21.5232 17.9684 14.3784 32.1682 29.3986 24.1985 8.0431 9.4516 27.1955 43.0473 33.2010 11.0652 2.0208 3.8888 19.4439 41.9287 29.6482 28.2051 30.2719
temp: 298.150 k
press: 1.00000 atm
elementType: 8 8 8 8 6 6 6 6 6 6 6 6 6 6 6 6 6 1 1 1 1 1 1 1 1 1 1 1 1 1 1 1 1 1 1 1 1 1 1
symmnumber: 1
zpe: 860050.3 jmol-1
zpe.correction: 0.327576 hartree
zpe.thermalcorrener: 0.348874 hartree
zpe.thermalcorrenthalpy: 0.349819 hartree
zpe.thermalcorrgfe: 0.276784 hartree
zpe.sumelectzpe: -808.106214 hartree
zpe.sumelectthermal: -808.084916 hartree
zpe.sumelectthermalent: -808.083971 hartree
zpe.sumelectthermalfe: -808.157006 hartree
dipole: -0.3100 1.4967 1.8210
dipole: 2.3775
quadrupole: -83.4701 -102.3697 -105.8168
quadrupole: 2.9103 0.6636 -2.9304
quadrupole: 13.7488 -5.1508 -8.5979 2.9103 0.6636 -2.9304
hfenergy: -808.4337898 hartree
pointgroup: C01 [X(C13H22O4)]
dipole: 0.073914 0.6208047 -0.6957398 debye
polarizability: 167.1156015|3.713903|164.5024167|6.8009398|-6.5080322|135.4332559 unknown
InChI: InChI=1S/C13H22O4/c1-6-10(5)13(7-2,11(14)16-8-3)12(15)17-9-4/h6H,7-9H2,1-5H3
charge 0 multiplicity 1
39 atoms
O  2.295043 -0.09447 -0.537069
O  -2.484185 -0.064931 -0.384371
O  0.955453 -1.820178 0.26811
O  -1.314766 -0.403295 1.595576
C  -0.076229 0.346958 -0.429091
C  -0.303487 0.308774 -1.979173
C  0.246107 1.775693 0.119142
C  1.074136 -0.646773 -0.143513
C  -1.318083 -0.110437 0.378915
C  -0.459623 -1.102711 -2.584342
C  0.896516 1.816661 1.491008
C  -0.100599 2.883153 -0.596758
C  0.110379 4.329579 -0.208855
C  3.492597 -0.985275 -0.422404
C  -3.753116 -0.409853 0.332208
C  4.080988 -0.930392 0.99018
C  -3.971141 -1.925183 0.343461
H  0.557015 0.824177 -2.443479
H  -1.213798 0.888277 -2.205814
H  -0.661064 -1.020778 -3.667925
H  -1.302276 -1.644965 -2.122233
H  0.450814 -1.715424 -2.458613
H  0.818119 2.810895 1.958916
H  0.422672 1.082026 2.167228
H  1.969649 1.558102 1.416918
H  -0.579367 2.748765 -1.57495
H  0.588562 4.450765 0.776415
H  0.747917 4.841497 -0.956666
H  -0.854198 4.874437 -0.190833
H  4.185392 -0.581714 -1.178124
H  3.190572 -2.013707 -0.68864
H  -4.526812 0.119833 -0.246499
H  -3.695307 -0.005083 1.357864
H  3.3670 -1.335136 1.726625
H  4.340137 0.105136 1.271418
H  5.00291 -1.539864 1.032184
H  -4.944385 -2.1579 0.814473
H  -3.979022 -2.331066 -0.68307
H  -3.17802 -2.428091 0.921077
