program: Gaussian 09
title: 000278374
version: EM64L-G09RevD.01
frameworkgroup: C1[X(C12H9NO4)]
method: RPBEPBE
basis: SDD
operation: Freq
keyword: #p
keyword: freq=noraman
keyword: PBEPBE/SDD
title: #p freq=noraman PBEPBE/SDD
converged: YES YES NO NO
title: Mulliken charges:
elementType: O O O O N C C C C C C C C C C C C H H H H H H H H H
charge: -0.392431 -0.132779 -0.221651 -0.346929 -0.432619 0.372478 0.334148 0.087502 0.180747 -0.182844 -0.174151 -0.367507 -0.373508 -0.221908 -0.230376 0.271467 -0.770375 0.298416 0.294270 0.366914 0.241515 0.243605 0.380993 0.271866 0.251918 0.251241
chargesum: 0.00000
title: Mulliken charges with hydrogens summed into heavy atoms:
elementType: O O O O N C C C C C C C C C C C C
charge: -0.011438 -0.132779 -0.221651 -0.346929 -0.065706 0.372478 0.334148 0.087502 0.180747 -0.182844 -0.174151 -0.069092 -0.079238 0.019607 0.013229 0.271467 0.004649
polarizability: 2.42770898e+02 1.35933862e+01 1.88226060e+02 2.75290430e-02 1.35065674e-03 6.20135650e+01
1716.lowfreq: -97.6988 -7.1658 -5.5049 -0.0007 -0.0003 0.0005 7.7937 54.5789 57.9865
frequency: -97.6970 54.5738 57.9713 95.6117 127.6730 161.0885 169.6443 184.9860 265.2864 291.3852 309.9275 332.8727 365.9493 381.5062 408.2184 421.7924 448.4952 471.9243 526.4234 560.2266 592.6392 600.4268 645.9794 669.4543 670.4251 727.4659 727.7694 791.1604 843.1323 867.6874 874.9924 931.3517 934.3793 949.3959 992.9885 998.2127 1011.9641 1042.7536 1042.9288 1058.7218 1091.8753 1172.7904 1184.0033 1204.9393 1222.0095 1270.1389 1281.2373 1323.5338 1346.4307 1382.7129 1393.6969 1403.2745 1439.2211 1457.3285 1465.4562 1481.2964 1493.8848 1531.0329 1566.8826 1580.3055 1603.7550 1614.4611 1636.8789 2006.6629 3000.5807 3084.5647 3140.2337 3145.4993 3153.8701 3167.6518 3181.2301 3309.6572
redmass: 1.0336 9.5231 5.3476 6.5288 4.7555 7.3025 4.3891 5.6768 4.7866 8.4218 7.0079 5.2508 9.0373 9.1691 6.5139 4.2437 4.5678 9.1740 6.5025 4.4491 3.9702 6.2039 6.5998 5.0790 6.4114 6.5137 3.9343 1.4422 7.4510 2.2652 1.2513 5.6308 1.9321 4.2523 1.4053 2.8346 1.3704 1.6057 1.9906 3.0922 2.1522 1.1845 2.4616 1.0538 2.7110 2.2532 2.1411 3.8258 4.2878 2.2698 1.7186 3.7828 2.4156 1.0849 1.0444 2.7179 8.2106 2.8372 7.9581 5.8364 5.7029 7.9942 1.6342 1.2107 1.0386 1.0980 1.0865 1.0987 1.0912 1.0969 1.0972 1.0766
irintensity: 0.3140 1.5493 4.1882 3.7932 0.7107 1.7472 15.4410 0.1254 5.4816 1.5184 5.1101 0.5693 2.5684 7.1202 0.3405 0.0539 6.9061 5.3391 27.0537 4.1123 0.1489 16.9426 10.8844 24.5697 14.7357 0.4325 11.4210 54.1594 3.9206 28.1475 57.1866 0.1983 0.0167 5.5940 4.8841 25.4108 0.0473 15.1198 0.7457 7.6503 4.4201 6.8835 3.8209 131.9335 44.5217 9.2957 81.7722 51.9636 63.9229 120.4437 23.6397 28.0044 12.4084 35.7889 21.0121 34.0604 373.9619 402.8527 22.8422 201.1032 86.0567 13.8190 50.2679 1383.7572 2.3260 7.4520 3.5660 4.8649 4.9453 14.9336 9.3142 108.0728
temp: 298.150 k
press: 1.00000 atm
elementType: 8 8 8 8 7 6 6 6 6 6 6 6 6 6 6 6 6 1 1 1 1 1 1 1 1 1
symmnumber: 1
zpe: 490148.8 jmol-1
zpe.correction: 0.186688 hartree
zpe.thermalcorrener: 0.199991 hartree
zpe.thermalcorrenthalpy: 0.200935 hartree
zpe.thermalcorrgfe: 0.146344 hartree
zpe.sumelectzpe: -817.161538 hartree
zpe.sumelectthermal: -817.148235 hartree
zpe.sumelectthermalent: -817.147291 hartree
zpe.sumelectthermalfe: -817.201882 hartree
dipole: 0.7614 -2.9545 -0.0035
dipole: 3.0510
quadrupole: -68.4855 -117.6512 -98.3849
quadrupole: 13.0491 0.0050 0.0028
quadrupole: 26.3550 -22.8107 -3.5444 13.0491 0.0050 0.0028
hfenergy: -817.348226 hartree
pointgroup: C01 [X(C12H9N1O4)]
dipole: -0.28771 -1.1647354 0.0385441 debye
dipolederiv: -0.9792409 -0.4581903 0.0279271 -0.0801749 -1.1201846 0.0211765 0.0180098 0.0314873 -0.3554129 -0.454188 -0.2458545 0.0109973 0.0166271 -0.8468491 0.0145024 0.0042055 0.0212848 -0.2805534 -0.5979455 0.5138423 -0.0057022 0.1506571 -1.0198033 0.0136881 0.003959 0.003546 -0.3213378 -0.8641673 0.0608079 0.0120527 -0.5503486 -0.9111662 0.0275738 0.024839 0.0112184 -0.3612017 -1.3549555 -0.214567 0.0342787 -0.8246891 -0.5159407 0.0279806 0.048954 0.0115419 -0.2412749 -0.1838556 -0.199558 0.0097974 -0.1558059 0.1365223 0.0005266 0.0091237 0.0014516 -0.0000301 -0.3975196 0.2422779 0.0049024 0.3108763 -0.3609401 0.0022476 0.0030323 0.0039649 0.031685 0.8533515 0.0330853 -0.019506 -0.1836822 1.2655426 -0.0238435 -0.013824 -0.0297792 0.1254963 0.363166 0.0235274 -0.0118637 0.3517236 -1.0520786 0.0163488 -0.0201729 0.025517 -0.0322012 0.8154325 0.1472362 -0.0213177 -0.2191382 1.0751114 -0.0189851 -0.0119123 -0.0282866 0.1422764 0.037795 -0.2476508 0.009416 -0.2792269 1.382617 -0.0234153 0.0098738 -0.0238375 0.1596667 -0.1678728 0.29541 -0.006217 0.0623439 -0.0579921 -0.0030665 -0.0005598 -0.0089887 -0.1142494 -0.0332043 -0.0038304 -0.0014669 0.1807184 0.0680981 -0.008897 -0.0064841 -0.0041397 -0.0931705 0.0921359 -0.2410114 0.0004098 -0.1367463 0.0925387 -0.00218 -0.002383 0.0005651 -0.1304779 0.115822 0.0192153 -0.0072665 -0.0555471 -0.0533886 -0.0010723 -0.0051051 -0.0031067 -0.1520944 1.4888529 0.0929814 -0.0350396 0.9993162 1.1540586 -0.0490539 -0.0529975 -0.0251923 0.1969314 -0.3921047 0.084616 0.0083118 0.2403317 -0.0425587 -0.003511 -0.0011492 0.000739 0.0256549 0.1162547 -0.073954 0.0030181 -0.0425332 0.0422414 0.0041403 0.0023186 0.0048582 0.1595834 0.0905016 -0.0052026 0.0018464 -0.0741131 0.0197987 0.0054548 0.0036606 0.0037123 0.1559333 0.3120876 -0.0636699 0.0009073 0.2662001 0.236504 -0.005899 -0.0070991 0.0030024 0.2875029 0.0189845 0.0868306 0.0013056 0.1076258 -0.0434504 0.002328 0.0007703 0.0028965 0.1556313 -0.1113805 0.0053387 0.0068327 -0.0070273 0.0959748 0.0018655 0.007112 0.0015464 0.1611184 1.09942 0.2059036 -0.0247894 -0.0078842 0.3255666 0.000983 -0.018871 -0.0044788 0.3566461 0.0339824 -0.0382256 0.0046008 -0.1097737 0.0060305 0.0078608 0.0082299 0.0054563 0.1366224 0.0482994 -0.0063798 0.012348 0.0219166 0.0687348 0.0955174 -0.0325964 0.0854758 -0.0123655 0.0503488 -0.0129783 -0.0157833 0.0183541 0.055013 -0.1022705 0.029066 -0.0904545 -0.000379 unknown
polarizability: 242.9170683|-13.1529821|187.893833|-4.3588968|-2.8647413|62.1996223 unknown
InChI: InChI=1S/C12H9NO4/c1-6(14)13-9-10(15)7-4-2-3-5-8(7)11(16)12(9)17/h2-5,13,15H,1H3
charge 0 multiplicity 1
26 atoms
O  -0.748047 -2.184418 0.106701
O  1.629831 2.838901 -0.084133
O  -1.185595 2.617202 -0.002056
O  -3.197262 -1.883742 0.162449
N  -2.466896 0.336876 0.090696
C  1.220445 -0.832827 0.021978
C  1.878546 0.432203 -0.027573
C  -0.257655 -0.927693 0.062353
C  -1.037896 0.24256 0.053769
C  1.090409 1.698812 -0.039992
C  -0.440649 1.573999 0.003909
C  1.993427 -2.018303 0.032554
C  3.291055 0.492852 -0.065682
C  3.403911 -1.947712 -0.005707
C  4.056338 -0.692857 -0.054725
C  -3.444519 -0.61284 0.138904
C  -4.875122 -0.114868 0.163041
H  1.474991 -2.979707 0.070589
H  3.764969 1.478951 -0.103779
H  -2.737371 1.338843 0.073337
H  3.992998 -2.870833 0.002715
H  5.149521 -0.641509 -0.083882
H  -1.843066 -2.192207 0.135051
H  -5.5503 -0.979998 0.213012
H  -5.107401 0.470128 -0.744987
H  -5.056161 0.533983 1.038658
