program: Gaussian 09
title: 000278433
version: EM64L-G09RevD.01
frameworkgroup: C1[X(C15H28O4)]
method: RPBEPBE
basis: SDD
operation: Freq
keyword: #pfreq=noraman
keyword: PBEPBE/SDD
title: #p freq=noraman PBEPBE/SDD
converged: YES YES NO NO
title: Mulliken charges:
elementType: O O O O C C C C C C C C C C C C C C C H H H H H H H H H H H H H H H H H H H H H H H H H H H H
charge: -0.274178 -0.268025 -0.220379 -0.238955 0.127335 -0.026662 -0.449534 -0.386427 -0.370662 -0.770574 0.165799 0.185643 -0.361373 -0.721588 -0.702631 -0.262926 -0.267138 -0.668220 -0.659264 0.212718 0.223250 0.212297 0.207547 0.218261 0.232105 0.194591 0.237625 0.209764 0.242892 0.189958 0.202870 0.218128 0.218796 0.210324 0.215864 0.208373 0.214374 0.233233 0.221574 0.217838 0.232421 0.224736 0.253618 0.217762 0.249100 0.240094 0.209646
chargesum: 0.00000
title: Mulliken charges with hydrogens summed into heavy atoms:
elementType: O O O O C C C C C C C C C C C C C C C
charge: -0.274178 -0.268025 -0.220379 -0.238955 0.127335 0.186056 -0.013987 0.039381 0.056034 -0.080293 0.165799 0.185643 0.031455 -0.074340 -0.064019 0.191881 0.183121 0.027896 0.039575
polarizability: 1.76948661e+02 1.50183408e+00 1.76540916e+02 -2.90808727e-01 6.10583959e-01 1.72951902e+02
1716.lowfreq: -10.2609 -4.0444 -0.0009 -0.0008 -0.0004 8.6949 26.5665 32.0370 40.6480
frequency: 26.2159 31.9201 40.6267 45.6115 51.4069 56.0139 63.8251 71.0353 80.6782 88.6275 101.3888 124.5524 150.5695 155.8412 165.1485 182.8222 200.7641 210.2609 219.3250 223.1973 229.6092 249.6158 273.4346 274.9032 303.7782 307.6551 322.4496 338.8607 369.0778 415.1686 423.1314 439.0047 448.3355 543.1835 569.1730 647.3409 706.7702 721.6469 735.6758 742.0378 772.1118 774.6315 802.7852 814.5578 819.4793 831.7432 846.5923 891.3678 898.8862 951.2811 962.2380 970.7887 994.8053 1004.7772 1013.9115 1018.7288 1043.3779 1060.7798 1083.2039 1088.4198 1091.7667 1097.3420 1100.1296 1122.9550 1132.9793 1154.0638 1155.6055 1164.6972 1173.3621 1193.8179 1229.4705 1264.6873 1270.3776 1275.9129 1279.9412 1290.4206 1299.8768 1312.0346 1327.9251 1338.3964 1348.4577 1354.4484 1357.0973 1361.1403 1387.1353 1389.2695 1390.0452 1391.5524 1394.4241 1441.6574 1453.7682 1456.7194 1461.1409 1461.7944 1463.0144 1464.3487 1471.5419 1473.8071 1475.3800 1477.1555 1483.7167 1484.1455 1484.6068 1486.0160 1492.0414 1619.2871 1627.4070 2962.6369 2972.4486 2974.0660 2975.4510 2976.9597 2991.7954 2992.2010 2995.6439 2997.1256 2998.5234 3009.7926 3026.6779 3027.2102 3037.3027 3043.0202 3066.9892 3070.2941 3072.0599 3074.8581 3077.9370 3085.8067 3086.4594 3091.7656 3092.2531 3095.1925 3102.9196 3117.8898 3121.7734
redmass: 3.6258 2.7664 2.1609 2.7710 3.0736 3.5173 1.7448 2.7425 3.4900 3.3880 4.5105 2.9125 2.7245 2.5023 3.0003 1.1536 1.7050 2.2933 1.1585 1.2369 1.5564 1.8833 3.4091 2.7972 2.8545 2.7142 2.9795 4.4412 4.4027 2.5254 3.7401 3.5450 2.8428 4.7025 4.0030 3.5431 2.7607 2.4804 1.5996 2.7293 1.3887 1.5473 1.6510 1.4159 1.7826 3.1310 2.2060 1.8343 1.7297 2.0923 1.6907 1.2377 2.6805 2.2443 2.9493 2.9668 2.9499 3.1982 2.6365 2.4901 2.1103 2.1673 2.2870 2.6581 2.9352 1.6855 1.7069 2.1862 3.3271 2.3638 1.4137 1.2889 1.3438 1.1251 1.1152 1.1836 1.1152 1.3371 1.3427 1.3785 1.2711 1.2894 1.3962 1.4359 1.2162 1.2153 1.2268 1.2262 1.1993 1.0846 1.0974 1.0954 1.0799 1.0449 1.0589 1.0517 1.0528 1.0634 1.0426 1.0489 1.0527 1.0580 1.0548 1.0774 1.0445 9.4632 9.9992 1.0588 1.0421 1.0580 1.0572 1.0443 1.0744 1.0392 1.0366 1.0364 1.0622 1.0964 1.0595 1.0592 1.0981 1.0975 1.1009 1.0994 1.0999 1.1023 1.0999 1.0978 1.0977 1.0981 1.1032 1.1031 1.0994 1.1056 1.1048
irintensity: 0.1303 0.4734 0.1150 0.3606 1.0715 0.9031 0.2560 0.5471 0.5562 0.5964 0.8783 0.1859 1.4199 1.3944 0.1496 0.1999 2.2843 1.0657 0.8015 1.1439 0.9477 0.1633 1.3043 0.2060 8.4394 6.1796 8.5977 5.7006 3.6810 1.9498 1.8437 3.0164 3.5732 8.8977 5.8818 3.2164 3.4206 7.3107 13.7878 3.4588 10.5689 1.4033 1.4593 2.2992 7.8061 4.5112 0.6850 2.1857 7.2798 3.2494 24.5623 2.0593 12.6698 17.8248 60.1228 76.6425 13.9759 8.4235 10.3840 247.9039 57.7414 4.0689 72.5584 18.2422 69.9228 12.6388 26.6584 25.3748 79.6656 75.9354 12.9572 6.9718 4.7488 4.8418 2.8731 1.5513 3.2341 11.4013 2.9734 3.8189 0.8880 0.6707 5.0027 1.0904 4.6996 11.8377 16.6485 29.8189 34.3994 7.4661 12.6905 9.9537 0.8405 13.8665 4.5441 13.9165 3.4864 3.9316 12.0495 6.2950 14.3947 1.8834 30.4609 11.6410 4.0066 144.4933 148.9917 20.7524 25.3671 49.4219 28.1017 20.6493 20.6910 14.9458 21.3333 29.8599 29.3302 11.0488 37.7710 25.3095 9.3156 8.6830 22.0649 46.2656 43.2814 85.0949 65.7809 52.9140 18.0622 30.0154 1.7339 6.8842 23.5078 30.5809 28.6371
temp: 298.150 k
press: 1.00000 atm
elementType: 8 8 8 8 6 6 6 6 6 6 6 6 6 6 6 6 6 6 6 1 1 1 1 1 1 1 1 1 1 1 1 1 1 1 1 1 1 1 1 1 1 1 1 1 1 1 1
symmnumber: 1
zpe: 1068020.5 jmol-1
zpe.correction: 0.406788 hartree
zpe.thermalcorrener: 0.431334 hartree
zpe.thermalcorrenthalpy: 0.432278 hartree
zpe.thermalcorrgfe: 0.350725 hartree
zpe.sumelectzpe: -887.747457 hartree
zpe.sumelectthermal: -887.722911 hartree
zpe.sumelectthermalent: -887.721967 hartree
zpe.sumelectthermalfe: -887.803520 hartree
dipole: 0.9997 2.0207 0.3783
dipole: 2.2860
quadrupole: -113.3258 -110.7986 -116.2042
quadrupole: -6.4285 -3.1148 1.5199
quadrupole: 0.1171 2.6443 -2.7614 -6.4285 -3.1148 1.5199
hfenergy: -888.154245 hartree
pointgroup: C01 [X(C15H28O4)]
dipole: -0.0383461 -0.8850801 -0.1551275 debye
polarizability: 175.7562829|-0.94654|177.8184485|-0.0586525|0.6808249|172.866748 unknown
InChI: InChI=1S/C15H28O4/c1-6-10-11-15(12(5)7-2,13(16)18-8-3)14(17)19-9-4/h12H,6-11H2,1-5H3
charge 0 multiplicity 1
47 atoms
O  -1.342968 -1.920564 0.168499
O  2.19399 0.144142 0.646862
O  -0.303741 -0.734835 1.879972
O  1.208216 2.096403 -0.133049
C  0.061614 -0.078684 -0.503131
C  0.611404 -0.991233 -1.687332
C  -1.135485 0.799673 -1.016885
C  1.304423 -0.137186 -2.78754
C  -1.955691 1.524052 0.07529
C  1.528142 -2.144876 -1.216036
C  -0.485762 -0.929111 0.658255
C  1.17546 0.853178 0.022777
C  -3.018529 2.465648 -0.535931
C  1.52266 -0.90204 -4.11228
C  -3.877664 3.167694 0.537524
C  -2.025294 -2.772866 1.191821
C  3.282546 0.951432 1.283852
C  -1.128606 -3.937256 1.622067
C  2.853538 1.414819 2.678446
H  -0.299263 -1.445662 -2.127883
H  -0.723348 1.565544 -1.698155
H  -1.804879 0.141845 -1.603396
H  2.281781 0.224544 -2.40811
H  0.701141 0.764312 -3.002417
H  -1.277472 2.113379 0.720427
H  -2.464291 0.787182 0.729857
H  1.028613 -2.772288 -0.458088
H  1.78172 -2.79975 -2.06861
H  2.463463 -1.758664 -0.778484
H  -3.675978 1.887905 -1.218403
H  -2.510166 3.227539 -1.16078
H  2.21037 -1.757407 -3.988994
H  1.956701 -0.235751 -4.88017
H  0.565144 -1.291817 -4.507104
H  -3.244833 3.768464 1.217305
H  -4.423087 2.428884 1.154976
H  -4.6236 3.84462 0.081862
H  -2.29433 -2.136595 2.053459
H  -2.933787 -3.118258 0.672816
H  4.131412 0.249911 1.321306
H  3.519815 1.806176 0.625984
H  -0.815659 -4.538474 0.750738
H  -0.231323 -3.566866 2.145251
H  -1.683889 -4.597068 2.314509
H  2.019294 2.132389 2.612343
H  2.531265 0.556779 3.291694
H  3.70263 1.912735 3.182885
