program: Gaussian 09
title: 000278405
version: EM64L-G09RevD.01
frameworkgroup: C1[X(C12H17N5O4)]
method: RPBEPBE
basis: SDD
operation: Freq
keyword: #p
keyword: freq=noraman
keyword: PBEPBE/SDD
title: #p freq=noraman PBEPBE/SDD
converged: YES YES NO NO
title: Mulliken charges:
elementType: O O O O N N N N N C C C C C C C C C C C C H H H H H H H H H H H H H H H H H
charge: -0.239342 -0.424605 -0.428043 -0.450166 -0.166505 -0.081457 -0.044892 -0.062749 -0.610243 -0.108305 -0.157475 -0.030713 -0.178533 -0.442535 -0.425950 -0.345326 0.176657 -0.219442 -0.110048 0.162112 -0.364982 0.234956 0.261368 0.210705 0.296224 0.196488 0.258435 0.226641 0.225035 0.222449 0.195150 0.338947 0.271902 0.345125 0.346906 0.244703 0.333752 0.343756
chargesum: 0.00000
title: Mulliken charges with hydrogens summed into heavy atoms:
elementType: O O O O N N N N N C C C C C C C C C C C C
charge: -0.239342 -0.085658 -0.082918 -0.103260 -0.166505 -0.081457 -0.044892 -0.062749 0.067265 0.126651 0.103893 0.179992 0.117691 0.012389 0.025726 0.072273 0.176657 0.052460 -0.110048 0.162112 -0.120280
polarizability: 2.38961308e+02 -4.63375515e-02 1.49039442e+02 2.61185401e+00 -2.61561757e+01 1.44961142e+02
1716.lowfreq: -9.1436 -6.5259 -1.3005 -0.0008 -0.0007 -0.0004 15.2639 20.4885 40.2985
frequency: 14.8514 20.4700 40.2817 57.1247 64.2031 90.3401 97.0780 118.3022 124.5180 153.3216 182.7669 190.6928 224.8753 253.7389 268.8976 276.0798 280.0852 289.7046 304.1066 329.5121 344.3451 369.9740 384.6918 462.6007 478.3314 509.1856 516.2512 522.9204 547.5596 550.8911 565.9869 613.1869 619.0178 648.7357 671.2491 695.2728 728.1267 785.2160 789.0149 802.0367 818.3600 849.9690 874.9986 898.7694 923.1889 930.9853 946.1639 957.2916 961.3259 980.5027 995.4794 1004.6443 1018.8417 1034.1677 1056.3246 1083.2272 1101.3799 1125.0120 1134.5585 1145.2049 1166.6899 1181.2666 1215.9727 1220.0022 1226.4942 1243.5954 1247.6210 1264.6875 1275.5059 1286.3732 1291.2669 1301.3651 1313.2893 1318.2234 1325.5865 1334.0835 1355.4873 1362.8183 1374.2505 1381.0300 1383.4228 1393.2637 1419.8656 1425.9116 1459.5576 1468.4368 1471.4690 1483.9269 1544.0410 1578.8523 1632.9104 2934.1195 2940.9243 2973.5589 2986.3632 2993.3356 2994.8276 3064.3083 3070.1435 3079.1728 3092.1812 3167.4903 3227.3234 3540.5237 3543.6159 3568.6942 3572.7428 3695.7058
redmass: 6.2023 6.3377 6.1916 4.7044 5.8080 2.2170 4.3511 4.3072 4.5609 5.2721 4.1043 5.9120 5.0461 3.5295 2.9387 1.8106 1.3120 1.8678 3.0635 3.7495 1.4086 3.6112 4.6033 3.8394 4.2923 8.6706 1.2278 3.1731 1.0526 4.2325 4.1971 5.0191 7.3668 5.0719 8.2848 7.4661 6.1289 4.2565 2.8037 1.4518 2.2660 8.2612 1.9824 3.4051 2.9345 1.4380 4.7042 3.0665 3.0132 5.1765 3.8736 3.3678 3.0068 2.7601 1.9849 2.0028 2.3960 3.6902 2.1837 1.3552 1.2069 2.1033 2.4844 1.3520 1.5344 1.3806 1.5970 1.3552 1.7186 1.1682 1.3687 4.7522 4.5022 1.3919 1.2960 1.3911 2.5546 1.4156 1.3325 2.7437 1.3169 1.3781 1.4177 3.0079 3.7273 1.0922 1.0842 1.0855 8.1964 1.9112 2.6587 1.0829 1.0554 1.0780 1.0833 1.0904 1.0652 1.0958 1.0908 1.0875 1.1006 1.0922 1.0981 1.0443 1.0661 1.0666 1.0665 1.1056
irintensity: 0.6121 0.0819 0.6329 4.6249 1.9079 7.5961 4.1467 1.6628 5.2488 8.7700 1.3614 3.8716 5.0211 8.3307 38.1724 40.9265 167.4837 43.5675 35.0971 52.4123 104.8054 42.1947 20.6574 5.5610 12.0058 3.3606 269.9926 12.5154 0.0674 5.0996 0.6464 29.3131 2.4997 51.3247 1.8655 17.8658 1.7668 92.6211 17.4779 0.4511 5.6387 9.2867 14.6742 20.4889 21.0304 10.1420 79.4258 31.8956 48.1194 91.7707 84.9132 66.5346 74.1591 24.2589 18.8676 8.1582 12.3802 5.9327 16.5598 22.4770 4.9997 47.3347 95.1181 28.3968 7.3189 23.8170 27.5278 18.8285 51.8287 0.4820 33.9231 33.4078 32.4590 2.2500 17.1832 12.1202 69.4714 5.3058 2.8276 6.0249 15.3364 13.9686 4.6387 73.8509 17.9615 7.5993 4.5713 4.9564 79.9156 39.8861 604.7761 30.5229 46.5921 3.2501 33.4759 71.8857 40.7764 15.2136 33.0342 7.1560 24.1876 17.2906 0.0179 127.2350 8.3618 11.4668 3.3304 49.2140
temp: 298.150 k
press: 1.00000 atm
elementType: 8 8 8 8 7 7 7 7 7 6 6 6 6 6 6 6 6 6 6 6 6 1 1 1 1 1 1 1 1 1 1 1 1 1 1 1 1 1
symmnumber: 1
zpe: 784859.4 jmol-1
zpe.correction: 0.298937 hartree
zpe.thermalcorrener: 0.319196 hartree
zpe.thermalcorrenthalpy: 0.320141 hartree
zpe.thermalcorrgfe: 0.247829 hartree
zpe.sumelectzpe: -1040.512465 hartree
zpe.sumelectthermal: -1040.492205 hartree
zpe.sumelectthermalent: -1040.491261 hartree
zpe.sumelectthermalfe: -1040.563572 hartree
dipole: 1.8210 0.9448 -1.0781
dipole: 2.3176
quadrupole: -120.7515 -124.2328 -120.2297
quadrupole: -6.2872 15.4077 0.9760
quadrupole: 0.9865 -2.4948 1.5083 -6.2872 15.4077 0.9760
hfenergy: -1040.8114016 hartree
pointgroup: C01 [X(C12H17N5O4)]
dipole: -0.7079221 0.076769 -0.5695106 debye
polarizability: 238.8378464|4.8473509|121.1290145|-0.3759127|-3.2110366|172.9950322 unknown
InChI: InChI=1S/C12H17N5O4/c13-10-8-11(15-4-14-10)17(5-16-8)12-9(20)6(1-2-18)7(3-19)21-12/h4-7,9,12,18-20H,1-3,13H2
charge 0 multiplicity 1
38 atoms
O  -0.974658 1.038728 1.464797
O  -1.962319 -2.154701 1.777497
O  -4.139968 2.64078 0.26356
O  -4.701543 -1.921201 -2.36919
N  0.676108 -0.208754 0.181366
N  1.806832 0.040135 -1.80711
N  2.6135 -0.237717 1.73935
N  4.758001 -0.007015 0.553842
N  4.913834 0.216185 -1.793645
C  -2.760462 -0.183539 0.403343
C  -1.601475 -1.180999 0.745158
C  -2.117736 1.222936 0.525625
C  -0.400972 -0.282369 1.182462
C  -3.44096 -0.446308 -0.95574
C  -3.002592 2.319308 1.137889
C  -4.197406 -1.778443 -0.993293
C  2.041358 -0.150836 0.506165
C  0.603428 -0.084737 -1.22131
C  2.717595 -0.000192 -0.732393
C  4.141161 0.072173 -0.673269
C  3.976632 -0.156291 1.668279
H  -3.523389 -0.278105 1.204194
H  -1.326962 -1.816218 -0.112545
H  -1.728675 1.56433 -0.460599
H  0.074702 -0.631131 2.113695
H  -2.69031 -0.454778 -1.772208
H  -4.152442 0.370218 -1.173831
H  -2.385742 3.213576 1.356991
H  -3.452337 1.961589 2.078364
H  -3.525835 -2.621932 -0.727588
H  -5.034399 -1.75928 -0.262021
H  -2.260072 -1.670438 2.590401
H  -0.340264 -0.103409 -1.762225
H  -3.822251 3.179644 -0.503987
H  -5.213401 -2.764857 -2.44825
H  4.514386 -0.217928 2.618891
H  5.925712 0.259366 -1.692039
H  4.474921 0.27441 -2.709928
