program: Gaussian 09
title: 000278404
version: EM64L-G09RevD.01
frameworkgroup: C1[X(C12H17N5O5)]
method: RPBEPBE
basis: SDD
operation: Freq
keyword: #p
keyword: freq=noraman
keyword: PBEPBE/SDD
title: #p freq=noraman PBEPBE/SDD
converged: YES YES NO NO
title: Mulliken charges:
elementType: O O O O O N N N N N C C C C C C C C C C C C H H H H H H H H H H H H H H H H H
charge: -0.287905 -0.446009 -0.456437 -0.446008 -0.434865 -0.161432 -0.084365 -0.079000 -0.060959 -0.607737 -0.143897 -0.131252 -0.149798 -0.091816 -0.155713 -0.425695 -0.329601 0.187316 -0.202799 -0.107635 0.172963 -0.367277 0.285910 0.269949 0.276621 0.239211 0.238610 0.218179 0.242737 0.210858 0.210471 0.356309 0.271649 0.357919 0.352374 0.352855 0.243671 0.347065 0.335532
chargesum: 0.00000
title: Mulliken charges with hydrogens summed into heavy atoms:
elementType: O O O O O N N N N N C C C C C C C C C C C C
charge: -0.287905 -0.089701 -0.098518 -0.093634 -0.082010 -0.161432 -0.084365 -0.079000 -0.060959 0.074860 0.142013 0.138697 0.126822 0.147395 0.082898 0.035222 0.091728 0.187316 0.068850 -0.107635 0.172963 -0.123606
polarizability: 2.25220184e+02 1.65575076e+01 1.37242646e+02 -1.84135445e+00 -1.27233090e+01 1.74168035e+02
1716.lowfreq: -9.2430 -5.2244 -1.8894 0.0003 0.0006 0.0010 22.9632 33.7461 40.3511
frequency: 22.2472 33.7220 40.2852 60.3560 74.8200 77.1483 105.8793 120.8168 146.5152 155.5110 170.1365 199.9235 210.0490 234.9546 245.7795 267.8657 286.0895 300.0143 306.2374 318.1562 380.4100 392.1810 447.2281 464.2754 472.5840 510.8993 521.6865 527.0119 534.0772 552.1021 553.0710 565.6908 574.0714 596.8287 606.2274 636.5157 646.3689 670.6165 693.2607 718.5953 789.7653 795.7829 815.3566 827.8636 856.8246 858.6169 891.5892 929.5356 931.8904 949.7776 960.4687 965.9782 995.6465 1007.9503 1025.9841 1034.0584 1041.8720 1064.8956 1076.7494 1110.4617 1122.7663 1144.3336 1149.6863 1169.8759 1182.1752 1217.4070 1224.2349 1232.1344 1246.9064 1255.8315 1269.8319 1275.0596 1284.6216 1298.6076 1300.9060 1319.9476 1323.2149 1328.9755 1339.7903 1354.0883 1361.6004 1370.0725 1377.7340 1387.8376 1390.3857 1400.6534 1408.5777 1437.0985 1463.5695 1467.4034 1475.4980 1541.4952 1580.3137 1634.9486 2962.6040 2990.5132 2993.7917 3004.6634 3014.1435 3035.3175 3063.1214 3070.2526 3080.7931 3162.9270 3230.9962 3483.3204 3496.8123 3505.9307 3538.8038 3569.7829 3693.5626
redmass: 5.7649 6.3886 6.2473 5.0636 5.3776 4.8046 4.3465 6.5032 4.8467 5.9517 3.8488 5.2399 4.6455 4.6494 4.5091 1.8379 2.1291 3.7442 4.2394 4.3099 5.3168 5.5299 3.1843 1.4388 2.4769 8.8708 2.4568 1.2476 4.7473 1.0651 1.1037 1.9804 1.9278 4.5536 3.6994 4.8002 4.5656 7.5731 6.4170 5.2180 6.3023 4.3756 4.3662 1.8281 4.0652 4.9454 1.8294 1.4360 6.3503 6.4108 2.5516 3.8504 2.9432 2.8542 4.0335 2.3806 2.6820 3.7854 2.3971 2.3170 2.5774 1.9827 1.1199 2.6153 1.8391 1.4450 1.9769 1.4613 1.6802 1.1986 1.9537 1.4073 1.2755 5.2506 1.2304 4.3206 1.2664 1.2859 1.7358 1.3825 1.2135 1.3932 1.4904 1.5991 2.4252 1.6007 1.6266 2.7419 3.9227 1.0907 1.0833 6.9149 1.8858 2.7380 1.0669 1.0716 1.0747 1.0851 1.0863 1.0849 1.0868 1.0973 1.1024 1.0920 1.0986 1.0644 1.0651 1.0649 1.0444 1.0665 1.1056
irintensity: 1.5794 0.1575 1.6529 0.8857 5.3878 9.0236 11.6519 2.4579 4.3521 9.5217 8.0710 2.3364 12.8936 9.1343 8.1695 68.0182 86.2078 2.0503 16.5671 27.0896 1.2310 2.0095 2.7241 66.8302 3.2918 3.2749 3.5121 238.2754 5.7148 39.5611 237.8781 24.5461 107.6046 17.7467 30.7087 4.8182 72.4469 2.2530 3.9114 23.5268 80.8585 42.4500 49.8713 7.9978 10.8080 58.1046 8.5473 11.6994 75.0249 216.5573 5.2403 5.0708 44.9982 74.3927 30.9927 0.4147 13.6589 30.9025 11.1025 12.0788 21.7611 33.4539 64.6634 32.3355 57.9311 36.2430 66.6330 0.8382 23.7261 45.5973 18.9980 6.2523 3.1399 51.8903 2.3791 23.7879 26.3755 67.1165 111.0362 13.4400 53.6156 15.7178 12.5816 21.1418 16.3276 18.4274 24.2396 58.6918 21.7694 4.3133 7.4557 54.6977 30.6084 637.0972 46.2128 18.2590 22.0620 14.5286 17.7651 21.0776 12.1389 31.0361 21.7430 13.9912 0.0689 18.7577 55.2054 11.5142 139.3600 13.2389 51.3816
temp: 298.150 k
press: 1.00000 atm
elementType: 8 8 8 8 8 7 7 7 7 7 6 6 6 6 6 6 6 6 6 6 6 6 1 1 1 1 1 1 1 1 1 1 1 1 1 1 1 1 1
symmnumber: 1
zpe: 799142.5 jmol-1
zpe.correction: 0.304377 hartree
zpe.thermalcorrener: 0.325000 hartree
zpe.thermalcorrenthalpy: 0.325944 hartree
zpe.thermalcorrgfe: 0.253971 hartree
zpe.sumelectzpe: -1115.665279 hartree
zpe.sumelectthermal: -1115.644657 hartree
zpe.sumelectthermalent: -1115.643713 hartree
zpe.sumelectthermalfe: -1115.715685 hartree
dipole: -0.8260 2.2312 -0.3265
dipole: 2.4015
quadrupole: -117.7633 -144.2664 -127.7207
quadrupole: 19.7819 2.2443 3.2793
quadrupole: 12.1535 -14.3496 2.1961 19.7819 2.2443 3.2793
hfenergy: -1115.9696563 hartree
pointgroup: C01 [X(C12H17N5O5)]
dipole: -0.2787578 -0.897328 -0.0989003 debye
polarizability: 226.5470776|-11.6781096|143.859446|1.9125196|-20.5341894|166.2243414 unknown
InChI: InChI=1S/C12H17N5O5/c13-10-7-11(15-3-14-10)17(4-16-7)12-8(21)5(1-18)9(22-12)6(20)2-19/h3-6,8-9,12,18-21H,1-2,13H2
charge 0 multiplicity 1
39 atoms
O  1.137787 0.308646 1.236363
O  1.263861 -3.138301 0.465523
O  3.820138 0.884707 1.485022
O  2.885785 -2.74459 -2.021706
O  3.854457 3.641183 0.888645
N  -1.03854 -0.717419 1.047308
N  -3.251631 -0.565582 1.651404
N  -1.182885 0.283986 -1.238033
N  -3.485591 0.940614 -1.805417
N  -5.306707 0.645436 -0.329104
C  2.28277 -1.000669 -0.392078
C  1.923342 0.455653 -0.043565
C  1.002457 -1.77997 0.002784
C  0.4003 -0.966303 1.179238
C  3.101893 1.378668 0.289721
C  2.668968 -1.284193 -1.848201
C  2.682705 2.842221 0.530831
C  -1.701712 -0.133933 -0.043202
C  -2.019786 -0.941477 2.030941
C  -3.063751 -0.054426 0.351854
C  -3.971641 0.512103 -0.590977
C  -2.149333 0.80478 -2.055566
H  3.101869 -1.322095 0.283401
H  1.259111 0.902923 -0.80975
H  0.299572 -1.786521 -0.852642
H  0.558875 -1.501278 2.130861
H  3.852745 1.346667 -0.520798
H  3.570245 -0.720436 -2.160449
H  1.83857 -1.039202 -2.532054
H  2.277594 3.293398 -0.391379
H  1.904039 2.880585 1.322453
H  1.679081 -3.608011 -0.307885
H  -1.771837 -1.390065 2.990965
H  3.112306 0.633413 2.139997
H  3.802945 -2.969351 -1.722899
H  4.358276 3.110481 1.562586
H  -1.812609 1.16012 -3.034132
H  -5.682091 0.33468 0.564604
H  -5.909775 1.060159 -1.036663
