program: Gaussian 09
title: 000278402
version: EM64L-G09RevD.01
frameworkgroup: C1[X(C11H15N5O4)]
method: RPBEPBE
basis: SDD
operation: Freq
keyword: #p
keyword: freq=noraman
keyword: PBEPBE/SDD
title: #p freq=noraman PBEPBE/SDD
converged: YES YES NO NO
title: Mulliken charges:
elementType: O O O O N N N N N C C C C C C C C C C C H H H H H H H H H H H H H H H
charge: -0.311405 -0.475629 -0.444906 -0.432973 -0.195198 -0.081094 -0.203175 -0.059462 -0.602758 -0.218286 -0.139764 -0.108584 -0.050471 -0.337202 -0.331851 0.250798 -0.196276 -0.100779 0.174170 -0.324617 0.273183 0.226485 0.246524 0.259393 0.175831 0.212930 0.199643 0.223704 0.405581 0.289663 0.379152 0.351675 0.254508 0.340151 0.351039
chargesum: 0.00000
title: Mulliken charges with hydrogens summed into heavy atoms:
elementType: O O O O N N N N N C C C C C C C C C C C
charge: -0.311405 -0.070048 -0.065754 -0.081298 -0.195198 -0.081094 -0.203175 -0.059462 0.088432 0.054897 0.086721 0.137940 0.208921 0.051559 0.091497 0.250798 0.093387 -0.100779 0.174170 -0.070109
polarizability: 2.30443273e+02 2.55961382e+00 1.72415965e+02 7.23909743e+00 -9.09031676e+00 9.61283563e+01
1716.lowfreq: -8.4031 -2.4246 -0.0008 -0.0007 0.0004 10.1732 31.1047 38.2832 61.4579
frequency: 31.0308 38.2692 61.4545 75.4314 89.2553 110.2470 113.1993 166.2974 175.1733 190.4701 224.7353 244.3952 258.3181 285.7565 312.6665 318.1001 324.9623 388.5744 420.7847 442.4062 473.7180 508.4244 521.3835 543.6030 553.1553 558.3296 563.0848 580.4921 590.8263 614.5291 638.3999 644.9893 664.2166 711.5938 775.5418 791.9349 809.2295 839.8500 869.9732 894.1579 925.1663 941.8135 952.8350 963.5748 973.7816 984.3621 1007.5991 1021.7613 1033.3266 1053.9696 1085.2148 1098.8116 1105.5589 1123.0278 1146.3288 1174.6077 1179.1953 1186.8889 1199.8976 1223.3396 1244.0770 1270.8717 1277.1464 1290.5300 1299.3181 1310.0669 1320.6009 1330.7023 1338.1607 1347.7711 1353.9055 1363.2428 1375.3104 1384.5258 1384.8442 1430.1240 1433.7948 1454.3789 1474.8832 1485.7122 1491.1009 1540.5318 1582.5639 1638.7225 2814.4816 2923.5576 2935.7812 2964.5637 2986.5052 2997.3227 3014.5703 3045.0588 3074.6701 3173.6754 3262.6400 3375.7462 3535.1618 3553.2699 3688.9304
redmass: 6.4333 6.0774 6.3532 5.2181 6.3525 3.5601 5.3230 4.9548 5.0764 3.6500 4.9547 4.3184 4.6663 4.5020 5.3753 5.0797 5.0597 4.4998 2.8462 1.3831 3.3883 3.1610 8.6969 1.5601 2.3839 1.0978 3.5053 3.2143 1.2485 7.0217 3.9642 4.4645 9.1873 7.0693 4.1640 7.1836 4.4495 1.5416 8.1235 1.8802 1.3025 1.2148 2.7924 2.4407 4.7834 4.6193 4.1631 4.2558 3.7301 4.1812 3.6973 2.7200 2.3119 2.4686 3.6794 1.2084 1.5834 1.4117 1.2353 2.6003 1.5114 1.6920 1.5343 2.2394 1.7783 1.3723 1.5345 1.9834 1.5142 1.3913 1.3748 1.3965 1.9278 4.2444 1.6046 1.1738 3.0361 1.0874 3.8582 1.1374 1.2527 8.2645 1.7977 2.8762 1.0704 1.0707 1.0815 1.0673 1.0848 1.0838 1.0842 1.0942 1.0970 1.0928 1.0990 1.0673 1.0446 1.0656 1.1056
irintensity: 0.0582 0.4802 1.0764 4.5269 3.3428 5.6105 4.8545 3.4134 6.2592 1.0279 7.6228 1.0265 5.1876 3.1311 8.0264 7.2372 3.0959 4.2894 49.7598 142.4489 9.7800 3.9919 10.3177 179.3609 58.9675 0.1911 12.2247 26.4926 99.5978 1.9589 15.4871 49.7187 18.7464 26.7033 6.9869 9.1364 46.9982 15.0701 1.9088 3.9810 70.2305 46.7984 107.4635 24.5841 91.2824 119.4731 26.8407 33.2628 2.7619 7.1004 25.9685 92.5826 9.6794 6.6430 18.4815 8.6890 47.1214 32.5769 3.7395 28.4119 21.4546 46.8978 108.1652 30.4746 41.8140 4.2139 5.6044 14.9799 54.0691 13.7565 13.6089 23.9914 33.8491 17.9106 35.7402 96.6511 34.3650 3.1715 27.9793 77.3169 197.0463 38.1710 27.7113 640.1374 1301.0034 50.0571 60.8372 35.6385 18.0146 6.5543 65.7012 44.4252 27.9673 8.6822 3.3807 118.5165 149.5590 8.0842 55.2097
temp: 298.150 k
press: 1.00000 atm
elementType: 8 8 8 8 7 7 7 7 7 6 6 6 6 6 6 6 6 6 6 6 1 1 1 1 1 1 1 1 1 1 1 1 1 1 1
symmnumber: 1
zpe: 715180.5 jmol-1
zpe.correction: 0.272398 hartree
zpe.thermalcorrener: 0.290178 hartree
zpe.thermalcorrenthalpy: 0.291122 hartree
zpe.thermalcorrgfe: 0.225943 hartree
zpe.sumelectzpe: -1001.311781 hartree
zpe.sumelectthermal: -1001.294001 hartree
zpe.sumelectthermalent: -1001.293057 hartree
zpe.sumelectthermalfe: -1001.358236 hartree
dipole: 4.1690 -2.4542 -0.0693
dipole: 4.8382
quadrupole: -113.2274 -136.2816 -116.5397
quadrupole: -1.0505 4.9884 1.7024
quadrupole: 8.7888 -14.2654 5.4765 -1.0505 4.9884 1.7024
hfenergy: -1001.5841789 hartree
pointgroup: C01 [X(C11H15N5O4)]
dipole: 1.6822744 0.8743142 -0.1697345 debye
polarizability: 228.6893158|-7.4439976|170.0546994|-14.8470486|-16.3910494|100.2435791 unknown
InChI: InChI=1S/C11H15N5O4/c12-9-7-10(14-3-13-9)16(4-15-7)11-8(19)5(1-17)6(2-18)20-11/h3-6,8,11,17-19H,1-2,12H2
charge 0 multiplicity 1
35 atoms
O  -1.811543 1.544738 0.124203
O  -1.052773 -1.974252 0.941279
O  -3.566437 -2.987319 0.072342
O  -4.24789 3.036093 -0.182981
N  0.466062 0.813258 0.114485
N  2.293341 1.958386 -0.672708
N  1.52197 -1.422098 0.464379
N  3.896087 -1.424852 -0.138342
N  5.014535 0.48479 -0.959141
C  -2.966339 -0.599805 0.211891
C  -1.444017 -0.831893 0.143629
C  -3.102835 0.847652 -0.296076
C  -0.889087 0.532389 0.634822
C  -3.734369 -1.684744 -0.568515
C  -4.250592 1.657945 0.30801
C  1.523091 -0.09934 0.101826
C  0.986943 2.032948 -0.354224
C  2.641584 0.625751 -0.385812
C  3.86732 -0.094586 -0.50135
C  2.751252 -2.006436 0.31332
H  -3.267623 -0.664309 1.27742
H  -1.135518 -0.959746 -0.919715
H  -3.140539 0.90659 -1.40165
H  -0.862192 0.559406 1.743264
H  -3.376075 -1.706577 -1.623362
H  -4.820773 -1.48453 -0.57671
H  -4.183753 1.621824 1.416281
H  -5.220068 1.235843 -0.008065
H  -0.023768 -2.034032 0.863396
H  0.358611 2.913045 -0.453553
H  -2.635048 -3.031483 0.437889
H  -3.362374 3.427465 0.032587
H  2.822761 -3.06266 0.586584
H  5.861914 -0.076593 -1.021832
H  5.013838 1.465136 -1.234669
