program: Gaussian 09
title: 000278370
version: EM64L-G09RevD.01
frameworkgroup: C1[X(C12H17NO2)]
method: RPBEPBE
basis: SDD
operation: Freq
keyword: #p
keyword: freq=noraman
keyword: PBEPBE/SDD
title: #p freq=noraman PBEPBE/SDD
converged: YES YES NO NO
title: Mulliken charges:
elementType: O O N C C C C C C C C C C C C H H H H H H H H H H H H H H H H H
charge: -0.276974 -0.208890 -0.016791 -0.297039 -0.517552 -0.476479 0.522969 0.068136 -0.389777 -0.767221 0.202763 -0.222240 -0.712705 -0.263078 -0.663057 0.263360 0.224327 0.237724 0.254650 0.251340 0.221905 0.236240 0.237174 0.233593 0.219133 0.226101 0.245779 0.238274 0.224642 0.221783 0.225466 0.256445
chargesum: 0.00000
title: Mulliken charges with hydrogens summed into heavy atoms:
elementType: O O N C C C C C C C C C C C C
charge: -0.276974 -0.208890 -0.016791 -0.033679 -0.055501 0.029511 0.522969 0.068136 0.068368 -0.296453 0.202763 -0.222240 -0.021692 0.199838 0.040637
polarizability: 1.49953230e+02 8.70227188e-01 1.25714233e+02 -8.19243141e+00 -1.07660545e+01 1.30750794e+02
1716.lowfreq: -12.6759 -7.9247 -2.6265 -0.0008 -0.0007 -0.0004 21.0449 36.0059 48.3520
frequency: 20.8791 35.4827 48.2375 61.1010 87.4648 111.3641 125.2842 132.5052 152.2030 178.0065 193.5943 203.8244 233.3780 256.0381 264.7160 317.9787 324.9660 341.8424 406.3902 427.3406 439.3205 471.8831 568.0018 585.2196 632.7414 663.0018 702.7469 724.9829 758.7252 770.6125 800.2059 813.9747 818.1628 831.2666 896.1193 921.4417 934.6595 937.9885 956.1830 982.9562 1011.9317 1043.4554 1067.5127 1077.9269 1084.8225 1090.3326 1095.8428 1097.9545 1124.0427 1156.7869 1161.4644 1173.3887 1188.8566 1222.9537 1275.6107 1293.1821 1326.9828 1351.7581 1372.9020 1390.4764 1393.1364 1426.7988 1442.5920 1455.9494 1457.0445 1463.6058 1467.1926 1477.6274 1484.3283 1486.5458 1625.8497 1646.9521 2199.3564 2986.9105 2994.4634 3013.5233 3031.4756 3075.7673 3082.9454 3088.7604 3096.1916 3097.3176 3099.4679 3100.6090 3107.7706 3111.6758 3121.7126 3196.5588 3208.8262 3219.0820
redmass: 4.1146 3.4977 2.7228 3.5602 4.7739 3.0116 3.9054 4.7511 3.4677 3.6924 1.5570 1.6837 1.8129 2.3478 2.0395 2.9984 3.3602 3.0371 4.4363 5.8860 3.8859 4.5160 4.7254 4.2594 3.0162 2.4371 2.0012 2.0444 1.5758 1.2915 1.6410 1.4358 2.3995 1.4606 3.2621 2.8314 1.9114 1.6068 2.7102 2.1397 2.6011 1.2023 1.2188 3.5396 2.6069 1.4832 1.2595 2.1600 3.4918 1.6615 1.4987 2.7124 2.7849 1.6569 1.1177 1.2657 1.3409 1.2689 1.7531 1.2231 1.2175 1.2716 1.0898 1.0854 1.0889 1.0441 1.2990 1.0411 1.0519 1.0511 10.2016 5.3374 12.6542 1.0357 1.0361 1.0647 1.0594 1.0980 1.0987 1.0977 1.1031 1.0782 1.0587 1.0987 1.0626 1.0655 1.1062 1.1167 1.1143 1.1158
irintensity: 0.8099 0.6096 0.5779 1.5677 0.3504 0.4226 2.0831 1.1553 1.1887 2.7045 1.9952 0.4184 0.7237 1.3015 0.6397 11.5682 1.3812 1.6837 2.1086 2.8347 1.1837 2.4057 4.8398 1.9729 6.9554 8.2865 6.5226 6.0284 7.0587 5.3587 4.5584 6.2099 1.3187 13.1174 6.4748 2.9494 56.9283 23.3614 0.4088 13.5409 66.5433 25.7705 15.4534 4.5798 240.4548 5.2389 1.9855 12.3262 84.8433 10.6595 5.2847 16.8284 61.2529 8.8620 3.4933 6.9230 3.6188 0.4648 4.1728 6.9555 35.9901 10.5198 13.8880 8.4410 15.8876 15.8946 2.7050 6.8528 16.7312 6.1198 150.0266 15.9801 4.5602 24.4410 16.7801 15.7294 25.8496 4.3829 35.7376 30.9930 1.5800 9.2205 11.5196 28.3126 5.8271 5.3089 26.8312 4.2473 11.8756 15.4887
temp: 298.150 k
press: 1.00000 atm
elementType: 8 8 7 6 6 6 6 6 6 6 6 6 6 6 6 1 1 1 1 1 1 1 1 1 1 1 1 1 1 1 1 1
symmnumber: 1
zpe: 690251.3 jmol-1
zpe.correction: 0.262903 hartree
zpe.thermalcorrener: 0.280113 hartree
zpe.thermalcorrenthalpy: 0.281058 hartree
zpe.thermalcorrgfe: 0.216749 hartree
zpe.sumelectzpe: -671.448304 hartree
zpe.sumelectthermal: -671.431093 hartree
zpe.sumelectthermalent: -671.430149 hartree
zpe.sumelectthermalfe: -671.494458 hartree
dipole: -2.1134 -2.3494 3.9180
dipole: 5.0336
quadrupole: -77.6408 -91.2723 -98.6907
quadrupole: 0.4346 1.6034 4.0383
quadrupole: 11.5604 -2.0710 -9.4894 0.4346 1.6034 4.0383
hfenergy: -671.7112067 hartree
pointgroup: C01 [X(C12H17N1O2)]
dipole: 1.045218 -0.9626147 -1.3793829 debye
polarizability: 149.4212606|2.6410515|129.6453903|-10.7355239|8.8274245|127.3516067 unknown
InChI: InChI=1S/C12H17NO2/c1-4-12(8-13,11(14)15-5-2)9(3)10-6-7-10/h10H,3-7H2,1-2H3
charge 0 multiplicity 1
32 atoms
O  2.123486 -0.435027 -0.483606
O  1.13993 -0.402385 1.628728
N  -1.416321 2.090961 1.355515
C  -2.347816 -0.873155 -0.084186
C  -3.075634 -2.215939 0.034685
C  -2.435471 -1.592428 1.283305
C  -1.0266 -0.735961 -0.776844
C  -0.123688 0.473848 -0.33469
C  0.287606 1.350422 -1.571803
C  -0.576572 -1.602909 -1.72122
C  1.097787 -0.142831 0.407782
C  -0.8426 1.339866 0.629731
C  1.135854 2.589139 -1.224326
C  3.331379 -1.114367 0.093199
C  4.301554 -0.086421 0.679554
H  -2.989797 0.01361 -0.161827
H  -2.600181 -3.108125 -0.383254
H  -4.166236 -2.2106 -0.046588
H  -3.080321 -1.147211 2.045539
H  -1.518323 -2.045531 1.669491
H  -0.647704 1.657887 -2.076348
H  0.838057 0.699028 -2.269848
H  0.414254 -1.51555 -2.178316
H  -1.204941 -2.434799 -2.054171
H  1.361982 3.159427 -2.143083
H  2.097677 2.301701 -0.763044
H  0.605543 3.264972 -0.530149
H  2.992777 -1.833402 0.859396
H  3.758833 -1.647286 -0.77088
H  5.222168 -0.597894 1.016595
H  4.584054 0.66658 -0.076341
H  3.854762 0.423775 1.548805
