program: Gaussian 09
title: 000278359
version: EM64L-G09RevD.01
frameworkgroup: C1[X(C7H9NO2)]
method: RPBEPBE
basis: SDD
operation: Freq
keyword: #pfreq=noraman
keyword: PBEPBE/SDD
title: #p freq=noraman PBEPBE/SDD
converged: YES YES NO NO
title: Mulliken charges:
elementType: O O N C C C C C C C H H H H H H H H H
charge: -0.221072 -0.177772 0.004987 0.335958 -0.521555 -0.265704 -0.708813 -0.691659 0.185457 -0.155267 0.255553 0.255622 0.300355 0.217156 0.233143 0.242013 0.217129 0.245281 0.249188
chargesum: 0.00000
title: Mulliken charges with hydrogens summed into heavy atoms:
elementType: O O N C C C C C C C
charge: -0.221072 -0.177772 0.004987 0.335958 -0.010380 0.034651 -0.016501 0.019939 0.185457 -0.155267
polarizability: 9.56598069e+01 5.33109874e-01 8.12452171e+01 -3.66138325e+00 2.25360001e+00 6.65292938e+01
1716.lowfreq: -15.7062 -7.4858 -7.0719 -0.0002 0.0003 0.0005 73.8931 95.6968 135.6078
frequency: 73.8250 95.6905 135.6065 184.7741 208.6410 232.2775 294.0047 325.5798 343.8164 414.0773 433.1103 454.3554 517.0085 568.1185 644.9963 657.1422 754.6424 824.7079 851.4017 882.2948 923.3428 944.4976 984.0320 1014.8088 1046.6488 1072.7952 1130.8824 1159.4576 1207.3555 1247.1618 1276.5752 1282.2474 1323.6833 1386.8546 1402.8411 1451.2013 1464.1322 1468.0907 1474.1437 1486.0226 1703.5293 2194.6550 2992.1136 2995.4013 3028.6199 3046.6554 3089.0909 3093.7550 3099.7341 3105.9041 3108.1007
redmass: 5.2535 4.4227 7.7272 1.0508 4.6212 1.0915 2.3990 2.7181 2.9155 5.7544 3.8129 3.9268 4.4849 4.7019 9.3038 4.8468 4.9249 3.7960 4.0428 3.2497 1.8229 1.5403 1.5975 1.6126 2.1834 4.9274 1.7645 1.5628 1.6305 2.3626 2.1151 1.5761 1.5344 1.2404 1.2030 1.0549 1.0575 1.0689 1.0660 1.0535 12.7886 12.5298 1.0359 1.0365 1.0645 1.0819 1.0994 1.0994 1.1016 1.1002 1.1028
irintensity: 2.7163 1.0848 3.8127 0.1942 2.4738 0.2656 1.7963 0.4795 1.3921 0.0973 3.0188 3.3331 7.1867 6.1570 3.0637 10.6410 3.3205 20.6796 12.9325 37.1190 11.3289 4.6953 14.2734 18.9666 13.7788 218.0175 41.5424 15.2605 1.7099 44.3773 13.3510 7.5205 14.3977 29.7098 19.4060 2.1421 5.3179 16.8011 3.9778 12.2906 354.1412 12.7180 11.4125 12.1287 15.7370 1.3438 7.2800 27.7289 1.7813 28.4529 17.5805
temp: 298.150 k
press: 1.00000 atm
elementType: 8 8 7 6 6 6 6 6 6 6 1 1 1 1 1 1 1 1 1
symmnumber: 1
zpe: 389386.9 jmol-1
zpe.correction: 0.148310 hartree
zpe.thermalcorrener: 0.158328 hartree
zpe.thermalcorrenthalpy: 0.159272 hartree
zpe.thermalcorrgfe: 0.113239 hartree
zpe.sumelectzpe: -476.576018 hartree
zpe.sumelectthermal: -476.566000 hartree
zpe.sumelectthermalent: -476.565056 hartree
zpe.sumelectthermalfe: -476.611089 hartree
dipole: -4.6908 -2.2739 3.3217
dipole: 6.1812
quadrupole: -66.0372 -69.6335 -55.5866
quadrupole: 4.4974 3.7546 2.3120
quadrupole: -2.2848 -5.8810 8.1659 4.4974 3.7546 2.3120
hfenergy: -476.7243276 hartree
pointgroup: C01 [X(C7H9N1O2)]
dipole: 1.4377084 -1.5627666 -1.1852502 debye
dipolederiv: -1.3848853 0.522803 0.013969 0.1934729 -0.6710916 0.0635457 -0.0318202 0.0187618 -0.3200073 -0.7600315 0.3156989 -0.0415872 0.3666275 -0.9925956 0.0992093 -0.0407465 0.0193346 -0.2888848 -0.2598326 -0.0219012 -0.0009288 -0.0287929 -0.2095989 0.0128965 0.0773925 0.0470546 -0.2270312 0.5971448 -0.1216322 -0.0285394 -0.3747539 0.5881504 -0.0574086 0.0435786 -0.0299166 0.423162 -0.0673904 -0.0851114 -0.0395026 0.0006685 -0.0185532 0.0201482 -0.0257969 0.0181148 0.0432165 -0.0018881 -0.1287922 0.0931197 -0.1699563 -0.1951983 0.0639213 0.1025085 0.0480174 0.1014677 -0.0921624 0.0220196 0.0728898 0.0121267 0.0179969 0.0300482 0.069339 -0.0158217 -0.0404275 -0.035514 0.0015431 0.002915 0.0452429 -0.0135482 -0.0019654 -0.0404107 0.0360098 -0.1651958 1.7529668 -0.5892783 0.0473786 -0.1148791 1.3945962 -0.1992418 0.0859325 -0.033182 0.1370844 0.0193595 0.0736382 -0.0714769 0.0418066 -0.0766989 -0.0654221 -0.2012245 -0.1505636 0.1574174 0.093075 0.0154807 0.0010396 0.0125962 -0.0674097 0.0475954 0.008621 0.0860641 0.0754968 0.0336336 0.0036386 0.0243471 0.017993 0.0893245 -0.0050084 0.0020466 -0.0429307 -0.1293923 0.0078469 -0.0036815 -0.0191224 0.0080691 0.1160926 0.0121033 -0.0132991 0.0122326 0.0318679 0.0548072 0.0500362 0.0126135 0.0942978 -0.1122156 -0.0088769 0.0178907 0.0182187 0.095733 0.0656737 0.0261536 -0.0734978 0.0036399 0.0951588 0.0545851 -0.0310194 0.0477442 -0.1082682 -0.0381665 -0.0768878 -0.0220603 -0.1194207 0.0383049 -0.0366145 -0.0603135 -0.0643679 0.0635483 0.0533831 0.0816104 -0.0167537 0.1127313 -0.0960665 0.0178903 -0.0230852 -0.0067924 0.080241 -0.006466 -0.0959032 -0.0630013 -0.1151134 0.0155898 -0.0478556 -0.0303941 -0.0162644 0.0659886 -0.0315537 0.0105654 0.1081982 0.0136438 0.0977624 0.0004499 0.0908008 0.0082865 0.0039837 unknown
polarizability: 90.9162401|-5.8436141|75.9396191|-9.5905801|-5.7517516|76.5784586 unknown
InChI: InChI=1S/C7H9NO2/c1-7(2)3-5(4-8)6(9)10-7/h5H,3H2,1-2H3
charge 0 multiplicity 1
19 atoms
O  0.991303 1.127079 -0.301576
O  -1.061107 2.215396 -0.352733
N  -2.077284 -0.963927 1.968343
C  1.506449 -0.30659 -0.218298
C  0.292344 -1.149527 -0.716211
C  -0.957191 -0.298364 -0.357185
C  2.718857 -0.379452 -1.15096
C  1.873859 -0.572702 1.251304
C  -0.403403 1.168068 -0.32675
C  -1.577156 -0.656221 0.929586
H  0.276102 -2.15031 -0.257767
H  0.342759 -1.265719 -1.812803
H  -1.738976 -0.344908 -1.135708
H  3.102757 -1.415002 -1.190094
H  2.44879 -0.064697 -2.173531
H  3.528087 0.276476 -0.788187
H  2.331827 -1.57344 1.35047
H  2.601628 0.179557 1.5994
H  0.990655 -0.530519 1.911999
