program: Gaussian 09
title: 000278369
version: EM64L-G09RevD.01
frameworkgroup: C1[X(C13H19NO2)]
method: RPBEPBE
basis: SDD
operation: Freq
keyword: #p
keyword: freq=noraman
keyword: PBEPBE/SDD
title: #p freq=noraman PBEPBE/SDD
converged: YES YES NO NO
title: Mulliken charges:
elementType: O O N C C C C C C C C C C C C C H H H H H H H H H H H H H H H H H H H
charge: -0.269573 -0.206977 0.002743 0.045281 0.377249 -0.765207 0.211971 0.038043 -0.851289 -0.372622 -0.199283 -0.683623 -0.685366 0.418601 -0.809295 -0.706934 0.243434 0.236154 0.256295 0.237462 0.257387 0.234639 0.262735 0.225060 0.218605 0.253092 0.220635 0.212718 0.232070 0.226870 0.226349 0.223773 0.235740 0.221186 0.232073
chargesum: 0.00000
title: Mulliken charges with hydrogens summed into heavy atoms:
elementType: O O N C C C C C C C C C C C C C
charge: -0.269573 -0.206977 0.002743 0.045281 0.377249 -0.029324 0.211971 0.275506 -0.096528 -0.147561 -0.199283 0.008709 -0.013708 0.418601 -0.123433 -0.253675
polarizability: 1.63993235e+02 -1.01089645e+01 1.65343586e+02 7.37543945e+00 1.67484370e+00 1.31594980e+02
1716.lowfreq: -21.8441 -10.3412 -5.6384 -0.0005 -0.0005 0.0004 12.6554 27.8347 43.6699
frequency: -17.1578 27.7477 43.6648 66.7972 74.1120 96.9617 110.1694 132.5899 157.5034 173.1186 183.3441 189.2782 197.6320 221.7720 234.5272 247.1373 281.2868 293.8152 308.5591 329.5433 357.8116 394.8084 404.0226 414.6235 429.9101 464.6778 482.4952 499.6235 527.0681 579.3970 655.8515 701.6345 722.2000 752.9056 770.6569 835.4113 867.6136 883.7277 895.8202 921.3252 927.0276 936.7474 942.2793 963.2472 1004.3803 1012.1537 1043.9277 1050.9800 1077.7432 1084.5090 1103.5189 1136.7736 1157.2247 1164.9447 1183.2545 1197.5994 1265.7144 1319.2788 1333.1478 1364.7014 1381.1100 1386.8551 1392.3553 1396.3735 1404.1456 1424.8213 1457.0542 1461.6313 1464.8663 1467.0702 1472.8985 1473.9726 1476.0468 1479.7387 1481.8321 1487.0474 1623.8537 1642.1345 1660.1268 2194.4728 2967.7033 2969.4163 2989.7119 2994.0108 3005.0353 3026.7113 3044.4244 3046.2407 3085.5421 3091.1724 3094.8611 3095.0435 3098.5197 3099.3049 3101.8025 3103.6477 3104.6718 3123.4403 3206.4687
redmass: 3.3839 3.6404 3.0391 3.6939 5.0195 5.3237 3.4283 3.7496 2.0781 1.6547 1.8812 1.8681 1.5836 1.6621 1.6972 1.4955 2.2768 1.0914 2.6101 4.1625 2.9220 3.4892 3.9128 3.2920 3.5656 3.5022 3.2720 3.4763 2.3901 5.0862 1.9800 2.0705 3.2371 4.3808 4.0136 3.5893 2.2007 2.1977 2.1105 2.0877 1.2192 1.3242 1.3829 1.8530 1.4392 1.8337 1.4778 1.5221 2.9325 2.6459 1.7560 2.7728 2.0739 2.8084 2.0703 3.2440 2.7267 1.3335 1.4382 1.5657 1.2540 1.1856 1.2079 1.2287 1.2545 1.2007 1.0504 1.0485 1.0490 1.0611 1.0522 1.0553 1.0563 1.0587 1.0498 1.0481 11.6023 4.9490 6.5545 12.6600 1.0404 1.0374 1.0355 1.0358 1.0345 1.0865 1.0936 1.0969 1.0994 1.0987 1.0949 1.0986 1.1009 1.0932 1.0716 1.1007 1.0885 1.1017 1.1140
irintensity: 0.0233 0.4668 0.4213 0.1380 0.3482 2.1947 0.6993 2.5360 0.6989 0.1100 2.7845 2.0737 1.8021 0.5061 0.6892 2.6263 0.6664 0.0723 2.4238 0.9869 1.3218 10.4111 5.5021 0.2986 0.3524 1.8447 2.9087 5.6672 9.5441 3.5354 0.6426 4.4389 2.3770 1.0847 13.8606 1.2345 1.6795 4.2938 12.4672 7.8096 2.2844 66.4525 0.1711 0.1404 5.3386 13.3641 6.7349 1.0750 406.4259 18.4012 6.7023 83.4067 11.1775 16.6087 10.5940 38.2201 7.5594 7.1859 3.3195 12.2111 26.3895 22.6137 15.8364 17.4871 29.9578 1.5473 6.2618 13.6024 11.9592 21.1962 14.8342 5.9015 9.3503 13.2053 13.2382 25.3783 190.7272 14.2825 6.3501 4.6892 21.6959 23.9915 12.5297 16.4216 10.5969 7.4291 12.3584 23.2205 9.2371 22.4704 10.6466 42.3424 11.3860 37.4310 5.0736 30.4333 7.8694 10.3699 21.6253
temp: 298.150 k
press: 1.00000 atm
elementType: 8 8 7 6 6 6 6 6 6 6 6 6 6 6 6 6 1 1 1 1 1 1 1 1 1 1 1 1 1 1 1 1 1 1 1
symmnumber: 1
zpe: 757693.3 jmol-1
zpe.correction: 0.288590 hartree
zpe.thermalcorrener: 0.307126 hartree
zpe.thermalcorrenthalpy: 0.308070 hartree
zpe.thermalcorrgfe: 0.242176 hartree
zpe.sumelectzpe: -710.701272 hartree
zpe.sumelectthermal: -710.682737 hartree
zpe.sumelectthermalent: -710.681793 hartree
zpe.sumelectthermalfe: -710.747687 hartree
dipole: -0.3402 -5.5949 2.2272
dipole: 6.0315
quadrupole: -86.7135 -115.7509 -93.2411
quadrupole: 4.2638 -0.6961 8.4323
quadrupole: 11.8550 -17.1824 5.3274 4.2638 -0.6961 8.4323
hfenergy: -710.9898624 hartree
pointgroup: C01 [X(C13H19N1O2)]
dipole: 0.0550031 -2.2825057 0.6466848 debye
polarizability: 165.8752364|-10.6218647|162.9850855|5.258711|5.7334203|132.0714789 unknown
InChI: InChI=1S/C13H19NO2/c1-9(2)7-11(5)13(6,8-14)12(15)16-10(3)4/h7,10H,1H2,2-6H3
charge 0 multiplicity 1
35 atoms
O  -1.650718 -0.70305 0.479166
O  -2.354646 1.259183 -0.56863
N  0.154812 3.720133 -0.138966
C  -0.09631 1.136542 0.516531
C  0.997838 0.342033 -0.259661
C  -0.008982 1.041292 2.069933
C  -1.496248 0.610568 0.065679
C  -2.94772 -1.393873 0.105487
C  0.845482 0.376743 -1.767926
C  2.005453 -0.290474 0.413261
C  0.009113 2.568546 0.133367
C  -2.839792 -1.890885 -1.34222
C  -3.119356 -2.505701 1.141043
C  3.123773 -1.091068 -0.143494
C  4.454753 -0.921113 0.57766
C  2.991776 -1.962113 -1.187317
H  -0.839132 1.605321 2.527914
H  0.936913 1.476943 2.43257
H  -0.080207 -0.011746 2.384066
H  -3.747105 -0.633909 0.188176
H  1.796956 0.136113 -2.268958
H  0.091989 -0.35862 -2.114991
H  0.505948 1.371728 -2.109615
H  2.043548 -0.17837 1.505626
H  -3.765189 -2.426597 -1.621925
H  -2.711123 -1.046452 -2.039997
H  -1.989999 -2.58793 -1.451127
H  -4.062335 -3.04937 0.951235
H  -3.156303 -2.091328 2.162908
H  -2.284412 -3.225828 1.084439
H  5.23363 -1.576846 0.153411
H  4.353286 -1.160412 1.654563
H  4.809251 0.125423 0.514258
H  3.846499 -2.544749 -1.550115
H  2.029757 -2.141536 -1.676951
