program: Gaussian 09
title: 000278358
version: EM64L-G09RevD.01
frameworkgroup: C1[X(C9H14O4)]
method: RPBEPBE
basis: SDD
operation: Freq
keyword: #pfreq=noraman
keyword: PBEPBE/SDD
title: #p freq=noraman PBEPBE/SDD
converged: YES YES NO NO
title: Mulliken charges:
elementType: O O O O C C C C C C C C C H H H H H H H H H H H H H H
charge: -0.223169 -0.248719 -0.194974 -0.242505 0.346688 -0.528307 -0.347087 -0.716011 -0.709794 0.167295 0.260409 -0.264966 -0.658767 0.255368 0.244853 0.297000 0.214747 0.229825 0.237868 0.271448 0.208029 0.233284 0.226873 0.233949 0.216321 0.247938 0.242404
chargesum: 0.00000
title: Mulliken charges with hydrogens summed into heavy atoms:
elementType: O O O O C C C C C C C C C
charge: -0.223169 -0.248719 -0.194974 -0.242505 0.346688 -0.028086 -0.050087 -0.033572 0.002967 0.167295 0.260409 0.195856 0.047896
polarizability: 1.36343348e+02 -8.94898254e+00 1.00067778e+02 1.18089826e+00 -1.60332618e+00 8.78628657e+01
1716.lowfreq: -9.1400 -2.4514 -0.0004 0.0003 0.0006 6.7676 30.1800 48.3348 71.2764
frequency: 30.0417 48.3105 71.2716 78.8329 88.2097 162.7836 178.2927 200.7982 220.7088 237.9941 263.2765 303.5051 316.3640 342.5697 365.1015 433.9455 441.3999 483.9797 554.8155 571.9748 623.1798 662.7380 709.6689 771.8914 779.4489 815.3603 844.7246 867.8162 890.6665 927.6996 955.3567 970.1442 1003.9366 1011.5442 1071.3213 1074.8163 1097.7726 1129.0444 1135.5219 1157.1471 1164.2249 1219.6167 1250.4302 1275.7676 1283.9399 1301.6723 1323.9433 1354.6153 1384.1589 1395.5113 1400.1096 1454.1411 1458.5711 1462.0369 1462.9024 1463.6630 1476.5144 1483.8110 1485.7326 1628.1045 1688.3309 2988.3476 2991.7134 2996.3748 3026.1412 3031.8382 3070.0029 3084.9668 3090.0582 3091.7094 3095.4374 3098.2549 3101.4093 3106.4804 3123.3609
redmass: 4.1781 3.7425 3.1744 4.4934 4.8048 3.0435 2.5900 1.0759 1.7205 1.1454 2.5035 2.5004 3.2475 2.5606 2.9627 3.5520 2.9661 3.8730 7.5950 4.8390 5.4944 4.6028 5.2717 5.4614 2.2518 1.5725 3.5627 3.1174 4.4070 1.7604 1.6817 1.7576 2.3875 1.5193 3.2906 3.7504 2.2086 2.6066 1.6184 1.6788 1.8897 1.5617 2.4283 1.1256 2.1322 1.7657 1.4745 1.3225 1.2375 1.2269 1.2058 1.0618 1.0937 1.0658 1.0461 1.0642 1.0609 1.0529 1.0540 8.1775 12.7750 1.0356 1.0362 1.0363 1.0620 1.0599 1.0853 1.0989 1.0996 1.0985 1.1020 1.1020 1.1010 1.1014 1.1061
irintensity: 2.5836 3.4763 1.1286 0.7737 0.3514 1.9815 2.1492 0.2978 1.6952 0.4403 2.3763 0.3546 17.5706 4.9790 1.8995 2.7166 1.5060 11.9212 4.2975 5.9256 8.7334 6.6124 2.3453 4.0241 9.7701 5.7515 13.8199 7.8745 45.7458 11.7493 5.6514 7.3592 61.4061 27.8728 130.5745 299.6600 9.9528 199.2404 68.0048 11.3801 45.0837 22.7028 26.6810 4.3247 12.1243 46.7433 49.7757 7.3456 30.1480 24.0730 23.7566 8.6007 21.7098 6.2234 14.5355 9.6374 1.2012 11.9692 14.9148 192.8071 300.3704 10.8908 25.7471 14.6276 22.2293 31.6273 0.4719 5.4720 26.5090 27.7550 12.5370 5.3101 22.2318 13.3096 28.9020
temp: 298.150 k
press: 1.00000 atm
elementType: 8 8 8 8 6 6 6 6 6 6 6 6 6 1 1 1 1 1 1 1 1 1 1 1 1 1 1
symmnumber: 1
zpe: 575450.8 jmol-1
zpe.correction: 0.219178 hartree
zpe.thermalcorrener: 0.233345 hartree
zpe.thermalcorrenthalpy: 0.234290 hartree
zpe.thermalcorrgfe: 0.177434 hartree
zpe.sumelectzpe: -651.248375 hartree
zpe.sumelectthermal: -651.234207 hartree
zpe.sumelectthermalent: -651.233263 hartree
zpe.sumelectthermalfe: -651.290119 hartree
dipole: 0.1885 -3.1513 -2.2672
dipole: 3.8867
quadrupole: -60.3899 -89.6396 -75.8353
quadrupole: -2.1869 -2.6625 -1.2250
quadrupole: 14.8984 -14.3513 -0.5471 -2.1869 -2.6625 -1.2250
hfenergy: -651.4675528 hartree
pointgroup: C01 [X(C9H14O4)]
dipole: -0.0787986 1.4242465 0.550995 debye
polarizability: 137.1406086|-5.6213687|90.2710877|-4.7426563|4.6981706|96.8622957 unknown
InChI: InChI=1S/C9H14O4/c1-4-12-7(10)6-5-9(2,3)13-8(6)11/h6H,4-5H2,1-3H3
charge 0 multiplicity 1
27 atoms
O  -1.569069 -0.487768 -0.943748
O  2.508867 1.171049 -0.545959
O  0.413927 -1.040617 -2.009787
O  1.144366 1.005614 1.341698
C  -2.136058 0.652471 -0.109345
C  -1.147955 1.838145 -0.366923
C  0.14961 1.208985 -0.919156
C  -3.546381 0.913908 -0.651317
C  -2.141769 0.1750 1.351496
C  -0.265183 -0.226739 -1.365741
C  1.285673 1.117931 0.100243
C  3.730786 0.948204 0.297092
C  3.994358 -0.549911 0.463679
H  -0.968857 2.398858 0.564462
H  -1.575165 2.526985 -1.115867
H  0.546178 1.721186 -1.810532
H  -3.998049 1.773812 -0.123694
H  -3.51704 1.140447 -1.731394
H  -4.192979 0.033329 -0.497323
H  -1.113529 0.056332 1.732321
H  -2.660548 0.917101 1.986028
H  -2.674561 -0.787803 1.433861
H  4.526566 1.451689 -0.273714
H  3.579545 1.448373 1.269908
H  4.950396 -0.700759 0.998409
H  3.19291 -1.029267 1.050367
H  4.060958 -1.047655 -0.518359
