program: Gaussian 09
title: 000278383
version: EM64L-G09RevD.01
frameworkgroup: C1[X(C14H25NO2)]
method: RPBEPBE
basis: SDD
operation: Freq
keyword: #p
keyword: freq=noraman
keyword: PBEPBE/SDD
title: #p freq=noraman PBEPBE/SDD
converged: NO YES NO NO
title: Mulliken charges:
elementType: O O N C C C C C C C C C C C C C C H H H H H H H H H H H H H H H H H H H H H H H H H
charge: -0.219228 -0.218352 -0.104270 0.020877 -0.115846 -0.420155 -0.407462 -0.447094 -0.609965 -0.549068 -0.678907 0.235239 0.215379 -0.488368 -0.487628 -0.674043 -0.674005 0.218572 0.255585 0.191901 0.234511 0.200798 0.212603 0.199478 0.215720 0.248702 0.244179 0.242729 0.222971 0.236775 0.194143 0.233326 0.233499 0.231028 0.230491 0.234679 0.211826 0.237875 0.223098 0.209061 0.227182 0.232164
chargesum: 0.00000
title: Mulliken charges with hydrogens summed into heavy atoms:
elementType: O O N C C C C C C C C C C C C C C
charge: -0.219228 -0.218352 -0.104270 0.239449 0.139739 0.006257 0.005939 -0.031896 -0.117084 -0.083367 -0.014663 0.235239 0.215379 -0.023841 -0.022458 -0.001244 -0.005598
polarizability: 2.14868983e+02 4.06291762e+00 1.50540357e+02 4.00167685e+00 2.93923730e+00 1.31868405e+02
1716.lowfreq: -14.3035 -7.4438 -0.0003 -0.0001 0.0009 12.9087 23.4697 24.5228 29.8583
frequency: 23.2810 24.0384 29.6879 40.7058 58.4969 67.7872 96.5573 115.2671 140.3830 141.6824 162.4108 183.0707 184.3702 217.0897 235.3180 248.8058 264.5780 275.4727 323.7172 338.1873 367.3728 398.7556 427.1766 436.7223 465.1695 495.1831 508.9513 515.2472 606.7114 621.0154 645.2475 724.7367 739.4656 749.1939 805.5480 814.0118 826.9569 839.0081 839.9947 896.1742 905.2386 949.5441 974.4434 995.0137 1001.3111 1018.6340 1025.0125 1034.3512 1050.1378 1054.0901 1073.6677 1087.7316 1099.7989 1106.7385 1111.9893 1117.2186 1129.6887 1144.5720 1152.3229 1180.8808 1200.1599 1225.0428 1238.6842 1248.1482 1255.6465 1266.2314 1272.1090 1282.9293 1310.6407 1320.1694 1331.2943 1334.7802 1340.0448 1343.1092 1348.3013 1359.8326 1366.7873 1394.2266 1395.8844 1428.8437 1430.4103 1432.0814 1441.9457 1450.9150 1451.8202 1461.8840 1467.8774 1469.7788 1472.4363 1477.3212 1478.1673 1479.9659 1489.7805 1612.9504 1628.5245 2867.0918 2874.9346 2957.2700 2958.5619 2971.4441 2975.0183 2977.8518 2985.9589 2993.6874 2996.4315 2997.6829 2998.7085 3006.4247 3006.6974 3023.8987 3027.2094 3033.2698 3047.4020 3058.9008 3064.9670 3077.4873 3092.9745 3093.0249 3098.2312 3101.6563
redmass: 3.7866 4.0795 4.0479 4.8040 2.0261 1.8554 2.4491 3.3391 2.7385 2.9932 3.3702 1.1892 1.3082 1.6017 3.0136 3.0205 2.1917 2.0092 2.6456 2.7339 2.3262 2.6958 2.9162 2.8829 2.2288 2.9279 2.6480 2.4701 2.2835 3.4839 3.2671 1.9052 1.6318 2.2107 2.6411 2.0423 1.9496 1.6916 2.6087 1.7221 2.3486 1.9434 2.1440 2.4406 1.8546 1.7151 1.4890 1.6069 1.9386 1.7128 2.0169 2.2835 2.1478 1.4666 2.0370 2.0469 1.7724 2.5357 1.4998 2.0479 1.3936 1.3551 1.3062 1.2421 1.7476 1.4416 1.3681 1.3467 1.2986 1.3400 1.6256 1.8438 1.3756 1.5381 1.5971 1.5966 1.3816 1.2116 1.2087 1.0978 1.0985 1.0959 1.1512 1.0899 1.1071 1.0881 1.0396 1.0400 1.0570 1.0798 1.0547 1.0497 1.0482 7.5231 7.7323 1.0596 1.0771 1.0609 1.0616 1.0606 1.0632 1.0622 1.0637 1.0610 1.0378 1.0371 1.0945 1.0834 1.0946 1.0739 1.0971 1.0975 1.1014 1.0996 1.1000 1.0995 1.1004 1.1004 1.0997 1.0998
irintensity: 1.5848 1.9657 0.2208 8.3311 1.0974 1.2639 0.5367 2.1656 0.6526 1.4287 1.5898 0.5111 0.1316 0.3840 3.5021 2.4162 8.8847 2.7396 6.2288 11.0365 1.1076 2.2137 0.1442 0.0445 1.5007 1.2393 8.7001 0.2452 2.5871 4.6218 8.5469 5.7932 1.9290 7.7041 2.4411 5.4353 1.6909 14.8564 22.0747 38.1763 6.6770 53.7494 17.3934 44.3172 14.4722 39.7376 3.7854 1.4540 14.8462 3.7805 2.1546 8.1239 3.7047 18.4168 2.7439 68.1480 58.9294 33.6426 7.2847 26.8008 0.1837 4.6279 10.7510 0.6570 0.4433 58.6467 63.2463 46.5399 7.4716 7.8907 18.7818 42.4797 10.4551 0.2616 75.6372 17.8744 2.7552 22.6842 22.1056 23.9587 16.6950 30.1787 5.0805 6.9168 4.4499 12.2874 12.4697 13.3363 15.1881 2.1893 16.6576 14.5952 18.5786 116.6935 72.0362 65.8123 53.7142 32.1666 27.0321 18.4619 18.4316 38.6872 27.4989 7.6835 32.1144 28.6686 14.8872 21.8970 10.9743 50.5248 12.8146 47.8477 55.5648 26.9928 28.4943 38.1489 30.0205 31.6256 29.1232 26.6921
temp: 298.150 k
press: 1.00000 atm
elementType: 8 8 7 6 6 6 6 6 6 6 6 6 6 6 6 6 6 1 1 1 1 1 1 1 1 1 1 1 1 1 1 1 1 1 1 1 1 1 1 1 1 1
symmnumber: 1
zpe: 962404.4 jmol-1
zpe.correction: 0.366560 hartree
zpe.thermalcorrener: 0.386473 hartree
zpe.thermalcorrenthalpy: 0.387418 hartree
zpe.thermalcorrgfe: 0.315804 hartree
zpe.sumelectzpe: -752.303253 hartree
zpe.sumelectthermal: -752.283340 hartree
zpe.sumelectthermalent: -752.282396 hartree
zpe.sumelectthermalfe: -752.354010 hartree
dipole: 2.7411 -0.1217 0.5719
dipole: 2.8028
quadrupole: -110.0317 -106.8703 -106.0273
quadrupole: 17.1375 7.6872 -4.6031
quadrupole: -2.3886 0.7728 1.6158 17.1375 7.6872 -4.6031
hfenergy: -752.6698131 hartree
pointgroup: C01 [X(C14H25N1O2)]
dipole: -1.0697038 -0.0124166 -0.2674726 debye
polarizability: 214.6153066|-4.2928449|150.8956047|6.0549174|0.6252739|131.7668342 unknown
InChI: InChI=1S/C14H25NO2/c1-4-13(16)9-11-7-6-8-12(15(11)3)10-14(17)5-2/h11-12H,4-10H2,1-3H3
charge 0 multiplicity 1
42 atoms
O  -3.24776 -1.403979 0.85954
O  4.217629 1.130655 0.582207
N  -0.04925 1.320759 -0.255033
C  -1.031867 0.199349 -0.125357
C  1.362546 0.881646 -0.41881
C  -0.90839 -0.752788 -1.34263
C  1.49154 -0.042614 -1.651328
C  0.53506 -1.250154 -1.560174
C  -2.477369 0.740027 -0.037688
C  1.98623 0.22791 0.88274
C  -0.192935 2.403468 0.739268
C  -3.530743 -0.332892 0.257526
C  3.500638 0.103552 0.75415
C  -4.957237 -0.012716 -0.195858
C  4.101563 -1.30171 0.826405
C  -6.026775 -0.950788 0.388615
C  5.62316 -1.349618 0.611963
H  -0.846587 -0.39368 0.804825
H  1.963833 1.792516 -0.605697
H  -1.241274 -0.201899 -2.245958
H  -1.589539 -1.609389 -1.192014
H  2.543132 -0.369255 -1.763219
H  1.237554 0.553122 -2.548919
H  0.829652 -1.918252 -0.726069
H  0.593423 -1.857054 -2.483493
H  -2.570969 1.473971 0.789591
H  -2.737919 1.289014 -0.964188
H  1.776385 0.905724 1.733125
H  1.526119 -0.751242 1.102303
H  0.662218 3.094549 0.637734
H  -0.22038 2.05015 1.799897
H  -1.10975 2.99028 0.55441
H  -4.958992 -0.06319 -1.306484
H  -5.173106 1.04903 0.042837
H  3.569895 -1.93546 0.085021
H  3.825369 -1.729705 1.81392
H  -7.025399 -0.706964 -0.015064
H  -5.794943 -2.002428 0.149952
H  -6.065254 -0.868676 1.488894
H  5.997085 -2.386687 0.680795
H  5.89348 -0.942569 -0.377746
H  6.144526 -0.73521 1.365714
