program: Gaussian 09
title: 000278391
version: EM64L-G09RevD.01
frameworkgroup: C1[X(C16H12Cl2N4O2)]
method: RPBEPBE
basis: SDD
operation: Freq
keyword: #p
keyword: freq=noraman
keyword: PBEPBE/SDD
title: #p freq=noraman PBEPBE/SDD
converged: YES YES NO NO
title: Mulliken charges:
elementType: Cl Cl O O N N N N C C C C C C C C C C C C C C C C H H H H H H H H H H H H
charge: 0.010120 -0.044915 -0.321327 -0.189568 0.025580 0.073953 0.045508 -0.446647 0.139474 0.187997 -0.207932 0.327263 0.176368 -0.166495 -0.436552 -0.362928 -0.327665 -0.345031 -0.226912 -0.213050 -0.104525 0.258722 -0.215069 -0.672151 0.243160 0.259127 0.225404 0.304510 0.344444 0.258015 0.261097 0.232377 0.232449 0.216072 0.229581 0.229547
chargesum: 0.00000
title: Mulliken charges with hydrogens summed into heavy atoms:
elementType: Cl Cl O O N N N N C C C C C C C C C C C C C C C C
charge: 0.010120 -0.044915 -0.321327 -0.189568 0.025580 0.073953 0.045508 -0.102203 0.139474 0.187997 -0.207932 0.327263 0.176368 -0.166495 -0.193392 -0.103801 -0.102260 -0.040521 0.031103 0.048047 -0.104525 0.258722 0.249757 0.003048
polarizability: 4.65621213e+02 -2.52534500e+01 2.81890082e+02 1.26978909e-01 2.46193615e-01 9.33124530e+01
1716.lowfreq: -5.7344 -3.0386 -0.0010 -0.0009 0.0013 1.9726 11.0969 18.0874 31.9326
frequency: 10.8364 18.0461 31.9283 34.8602 38.5046 53.4997 78.1206 83.0918 107.6236 140.2233 151.2339 156.5001 190.6768 219.2659 224.2100 231.4556 247.1116 288.4104 288.8617 301.8697 331.4172 367.0462 374.1994 405.3602 409.3892 449.4677 452.4744 509.8860 549.5392 558.9843 577.6162 596.7598 624.1085 634.3060 637.6332 646.0223 690.1904 710.7470 713.2951 723.8234 726.3816 774.1859 800.8717 808.1304 826.3171 831.8553 852.0829 855.6115 864.2326 907.1091 924.6509 957.3311 966.4254 993.0161 1002.5864 1003.5247 1041.5258 1061.8017 1074.6130 1104.7654 1114.7200 1121.7003 1139.9241 1159.7130 1188.0119 1215.8361 1243.2729 1251.5703 1291.8048 1293.1607 1303.6684 1328.0233 1353.8922 1358.7398 1383.6263 1399.0765 1400.4419 1423.8254 1459.3639 1463.4379 1466.9509 1476.3883 1489.2330 1496.7630 1507.3336 1525.2864 1576.6728 1594.8236 1600.8582 1700.8858 2996.3740 3010.0045 3068.5061 3093.7190 3107.1180 3147.3712 3157.8777 3159.1644 3159.6415 3174.7413 3178.5958 3546.1611
redmass: 3.9680 3.7353 9.8797 5.9803 6.2152 3.1031 6.8937 7.5369 4.1670 4.5684 5.6368 15.1605 5.5008 6.8315 9.4390 9.4974 1.2486 4.7502 7.8877 7.2119 7.7610 3.7563 10.0382 2.8857 6.2537 8.6154 5.8492 4.0355 7.6646 7.6746 6.4047 9.0501 7.4317 10.4773 1.9526 2.3276 3.4657 7.4804 4.8737 6.8794 3.2516 6.4393 1.0962 4.4151 1.5103 7.8847 1.6944 1.4187 4.6282 1.6265 6.6003 1.3691 6.8509 4.6198 1.3515 3.4494 3.8410 4.0240 2.4949 2.7657 1.4123 2.8946 1.4675 3.5563 1.1468 1.7850 7.3546 1.1283 3.5876 1.7818 1.9769 3.5869 4.7200 1.3537 6.4898 3.6389 1.2942 3.1591 3.0720 1.0403 4.5756 1.0773 1.1018 3.2190 4.6001 3.2237 7.5706 6.5332 6.4483 8.7914 1.0357 1.0581 1.1069 1.0986 1.1028 1.0902 1.0938 1.0891 1.0891 1.0961 1.0975 1.0763
irintensity: 1.3462 0.0729 0.0357 0.0082 0.2522 2.2991 0.2551 0.6175 0.0010 11.2299 3.1442 0.8156 0.4806 1.9808 3.7745 1.4303 1.3883 0.0221 6.4810 8.2699 0.0085 8.9585 3.1021 0.0090 2.8888 17.5313 0.3145 36.1079 4.1930 8.8775 0.5743 1.6380 3.7210 11.9787 32.0283 13.2354 11.3251 25.8464 52.5791 9.2206 2.9502 0.6356 4.1093 2.3675 16.6990 47.1543 42.9017 57.3576 2.4022 9.8068 70.7047 0.2167 78.7146 140.9121 1.1651 8.8723 428.9433 26.0565 90.4437 268.1355 5.6124 280.3238 5.0968 258.2228 28.3177 5.8633 17.1519 0.0013 88.7926 94.0846 14.8441 16.5951 18.3689 15.5147 37.2014 4.9451 35.6068 45.9217 36.3975 12.4670 702.7429 10.5725 11.9551 39.4674 659.3021 510.2687 9.4733 225.7027 65.2103 161.1282 24.8144 20.0048 7.2794 28.8001 45.3307 10.3535 0.5975 4.4564 2.6577 5.6247 8.0138 72.8173
temp: 298.150 k
press: 1.00000 atm
elementType: 17 17 8 8 7 7 7 7 6 6 6 6 6 6 6 6 6 6 6 6 6 6 6 6 1 1 1 1 1 1 1 1 1 1 1 1
symmnumber: 1
zpe: 666104.0 jmol-1
zpe.correction: 0.253706 hartree
zpe.thermalcorrener: 0.275405 hartree
zpe.thermalcorrenthalpy: 0.276349 hartree
zpe.thermalcorrgfe: 0.197806 hartree
zpe.sumelectzpe: -1904.801259 hartree
zpe.sumelectthermal: -1904.779560 hartree
zpe.sumelectthermalent: -1904.778616 hartree
zpe.sumelectthermalfe: -1904.857158 hartree
dipole: -3.9649 0.8743 0.0233
dipole: 4.0603
quadrupole: -117.6102 -154.1888 -153.8616
quadrupole: 15.1179 -0.0254 -0.0353
quadrupole: 24.2767 -12.3019 -11.9747 15.1179 -0.0254 -0.0353
hfenergy: -1905.0549648 hartree
pointgroup: C01 [X(C16H12Cl2N4O2)]
dipole: 1.5302037 -0.4578498 0.0250209 debye
polarizability: 460.8893265|-38.5148593|286.3717274|1.1715612|-6.9542641|93.5626935 unknown
InChI: InChI=1S/C16H12Cl2N4O2/c1-2-24-16(23)22-13-7-11(18)14-15(21-13)20-12(8-19-14)9-3-5-10(17)6-4-9/h3-8,22H,2H2,1H3
charge 0 multiplicity 1
36 atoms
Cl 1.48453 -4.684973 0.184411
Cl -7.137499 2.828546 -0.075217
O  5.461083 1.449643 -0.026414
O  3.257064 2.284056 -0.073572
N  -0.929255 -0.009771 0.019364
N  1.416933 -0.022673 0.018291
N  -1.016859 -2.866313 0.123945
N  3.795844 -0.051267 0.020033
C  -2.112963 -0.675567 0.045438
C  0.185131 -2.191864 0.09769
C  0.239493 -0.737695 0.044675
C  -3.35199 0.144671 0.017399
C  2.562857 -0.72248 0.04318
C  1.441689 -2.881146 0.121019
C  -2.134478 -2.120507 0.098449
C  2.630478 -2.167703 0.094676
C  -4.651946 -0.432217 0.043733
C  -3.236564 1.562426 -0.037906
C  -5.80564 0.378099 0.015954
C  -4.378978 2.383789 -0.066313
C  -5.651766 1.777158 -0.038883
C  4.052911 1.331062 -0.031296
C  5.976595 2.848946 -0.075944
C  7.498659 2.757025 -0.059086
H  -3.076113 -2.675731 0.120405
H  3.593841 -2.685715 0.112271
H  -4.789054 -1.516938 0.086104
H  -2.232605 1.996406 -0.057649
H  4.642143 -0.624553 0.045062
H  -6.803374 -0.068917 0.036431
H  -4.284302 3.472355 -0.108712
H  5.591522 3.329216 -0.993628
H  5.576021 3.39805 0.795328
H  7.93284 3.772665 -0.093646
H  7.854601 2.259407 0.859194
H  7.870552 2.191713 -0.930684
