program: Gaussian 09
title: 000278372
version: EM64L-G09RevD.01
frameworkgroup: C1[X(C13H21NO2)]
method: RPBEPBE
basis: SDD
operation: Freq
keyword: #p
keyword: freq=noraman
keyword: PBEPBE/SDD
title: #p freq=noraman PBEPBE/SDD
converged: YES YES NO NO
title: Mulliken charges:
elementType: O O N C C C C C C C C C C C C C H H H H H H H H H H H H H H H H H H H H H
charge: -0.275263 -0.214284 -0.009320 0.013481 0.445435 -0.592045 -0.372897 -0.695614 -0.295438 0.241027 -0.465211 -0.692504 -0.224600 -0.669922 -0.263436 -0.661939 0.228254 0.211211 0.250744 0.201529 0.246181 0.229298 0.232186 0.233879 0.210528 0.217006 0.222947 0.203434 0.223027 0.220180 0.223413 0.212171 0.223535 0.238944 0.220537 0.255891 0.227637
chargesum: 0.00000
title: Mulliken charges with hydrogens summed into heavy atoms:
elementType: O O N C C C C C C C C C C C C C
charge: -0.275263 -0.214284 -0.009320 0.013481 0.445435 -0.152580 0.079377 0.012051 -0.061559 0.241027 -0.037678 -0.043097 -0.224600 -0.014158 0.199042 0.042126
polarizability: 1.56852889e+02 -4.20348913e+00 1.72498433e+02 -7.39985307e-01 -4.94002839e+00 1.25894481e+02
1716.lowfreq: -2.2919 -0.0008 -0.0006 -0.0005 5.9620 10.4197 19.3554 28.5060 42.9000
frequency: 19.2491 28.4117 42.7360 46.5101 60.7957 83.9407 90.7505 102.8497 123.4904 138.2157 157.0339 182.0636 201.1931 206.6354 225.8919 231.5254 244.5396 255.3268 282.2024 318.4097 340.4464 359.9518 390.5157 421.8692 431.1049 465.9501 473.3819 566.3086 579.8096 660.6895 692.6946 725.8444 745.4880 781.1885 795.6478 817.1982 846.7124 871.0087 877.8927 895.6869 897.9746 926.4141 1006.3623 1015.0317 1034.3493 1055.1898 1063.1004 1068.5461 1088.3613 1092.3665 1098.1912 1113.8098 1146.5640 1156.4917 1182.6201 1205.8431 1235.3061 1252.9288 1273.6618 1276.9808 1293.5564 1307.7357 1342.9051 1353.5612 1363.5261 1386.4900 1386.8890 1393.2999 1394.7436 1456.9159 1460.4181 1461.9684 1463.0686 1472.7010 1473.5081 1475.3492 1476.6839 1480.0530 1484.0081 1484.8347 1495.4819 1624.4714 1661.2066 2196.0194 2969.2480 2971.9400 2978.7873 2981.0763 2991.7213 2995.4855 3007.4164 3029.0177 3032.4081 3044.0366 3050.0701 3071.9479 3076.1266 3076.5126 3082.8267 3090.2401 3090.9527 3096.6274 3104.3989 3122.2810 3134.9990
redmass: 3.5521 2.9347 3.4429 3.5087 2.8831 1.7782 5.1763 3.2847 4.2343 4.3054 3.1609 2.4528 1.4904 1.8937 1.2358 1.2333 1.5044 1.9247 2.5361 3.1145 3.0906 2.3680 5.2503 3.7101 5.6304 3.7480 3.5205 5.3046 4.2370 3.6984 4.6138 2.9748 1.1793 1.3655 2.2231 1.6338 2.7071 1.4729 1.4849 1.9187 1.5775 1.9450 2.4759 2.2827 2.3281 2.7450 3.4223 1.7239 2.6489 2.2133 2.2418 1.8459 2.7488 1.6869 2.4788 3.4185 1.3430 1.2023 1.2779 1.1195 1.1142 1.4081 1.3628 1.2636 1.4710 1.2108 1.2124 1.2147 1.1931 1.0964 1.0862 1.0494 1.0440 1.0525 1.0514 1.0438 1.0508 1.0535 1.0686 1.0517 1.0950 10.2651 7.4033 12.6550 1.0659 1.0358 1.0355 1.0615 1.0611 1.0362 1.0353 1.0976 1.0593 1.0940 1.0995 1.1004 1.0998 1.0989 1.0995 1.0975 1.0911 1.1036 1.1015 1.1063 1.0999
irintensity: 1.0125 0.7081 0.6818 0.3444 0.0770 0.2709 1.3283 1.1296 0.4123 2.4936 1.8535 1.0867 1.2464 2.3510 0.0813 0.4139 0.4013 0.2420 0.1367 14.2059 1.0643 0.5710 0.6123 3.4244 5.0070 0.6409 1.9809 1.4376 6.2440 14.1462 9.4819 5.4785 3.3570 7.7547 4.6594 5.5039 0.4311 0.6695 7.0909 3.8259 16.8947 12.4992 29.2305 5.0592 4.7493 1.8237 166.1961 4.6835 125.2483 8.5675 15.9811 19.0274 98.0754 4.0138 7.7367 52.9274 1.8932 3.5829 0.5326 4.7081 1.5867 0.5873 0.8711 0.8992 6.8926 13.5897 11.1922 25.4299 10.7260 13.7284 3.9802 12.6630 12.7208 2.7960 15.4303 13.6815 10.4591 6.3848 10.1218 14.8492 20.2729 147.8810 0.4590 6.6145 25.7934 38.8120 40.2454 3.0624 41.4478 17.0825 16.1535 3.5264 24.4587 4.5437 4.0530 55.5572 28.2249 60.1438 39.8594 31.7565 40.7732 0.9873 21.3031 27.1258 11.1627
temp: 298.150 k
press: 1.00000 atm
elementType: 8 8 7 6 6 6 6 6 6 6 6 6 6 6 6 6 1 1 1 1 1 1 1 1 1 1 1 1 1 1 1 1 1 1 1 1 1
symmnumber: 1
zpe: 821587.9 jmol-1
zpe.correction: 0.312926 hartree
zpe.thermalcorrener: 0.332875 hartree
zpe.thermalcorrenthalpy: 0.333820 hartree
zpe.thermalcorrgfe: 0.262634 hartree
zpe.sumelectzpe: -711.885278 hartree
zpe.sumelectthermal: -711.865328 hartree
zpe.sumelectthermalent: -711.864384 hartree
zpe.sumelectthermalfe: -711.935570 hartree
dipole: -1.1025 5.3371 -0.9190
dipole: 5.5267
quadrupole: -84.7471 -109.7346 -98.9992
quadrupole: -2.3501 0.7085 2.1268
quadrupole: 13.0799 -11.9077 -1.1722 -2.3501 0.7085 2.1268
hfenergy: -712.1982039 hartree
pointgroup: C01 [X(C13H21N1O2)]
dipole: 1.4997077 1.5698534 -0.1198911 debye
polarizability: 164.7194249|8.669577|164.4278582|-4.6977696|-3.8008341|126.09852 unknown
InChI: InChI=1S/C13H21NO2/c1-5-8-11(9-6-2)13(4,10-14)12(15)16-7-3/h8H,5-7,9H2,1-4H3
charge 0 multiplicity 1
37 atoms
O  2.458105 -0.397552 0.003538
O  0.939548 -1.48235 1.399752
N  -1.635998 -2.474568 -0.888515
C  0.147646 -0.487814 -0.745578
C  -0.50312 0.874789 -0.294155
C  -1.96106 0.854394 0.133435
C  -2.164467 0.3865 1.605104
C  0.770935 -0.378295 -2.172794
C  0.293197 1.982028 -0.26566
C  1.196048 -0.872474 0.33979
C  -0.101573 3.388425 0.132849
C  -3.658211 0.302346 1.980924
C  -0.851368 -1.582825 -0.786761
C  0.131601 4.406815 -1.014476
C  3.549002 -0.64775 1.004294
C  4.16608 -2.03189 0.793673
H  -2.542825 0.183496 -0.528439
H  -2.399831 1.862964 0.018561
H  -1.686092 -0.599942 1.751776
H  -1.638378 1.092136 2.278195
H  1.551522 0.39539 -2.185639
H  1.222453 -1.33713 -2.479735
H  -0.017205 -0.106296 -2.894815
H  1.348641 1.876921 -0.560428
H  0.51091 3.695095 1.006363
H  -1.154763 3.432877 0.462207
H  -4.183091 -0.433687 1.343804
H  -4.162124 1.280023 1.855334
H  -3.786381 -0.011453 3.032814
H  -0.108534 5.434133 -0.684774
H  -0.501234 4.167208 -1.887769
H  1.185974 4.394751 -1.348181
H  4.266612 0.164248 0.806316
H  3.121138 -0.545328 2.016812
H  5.021939 -2.162952 1.481516
H  3.431222 -2.826098 1.005304
H  4.534477 -2.147631 -0.240139
