program: Gaussian 09
title: 000278366
version: EM64L-G09RevD.01
frameworkgroup: C1[X(C12H19NO2)]
method: RPBEPBE
basis: SDD
operation: Freq
keyword: #p
keyword: freq=noraman
keyword: PBEPBE/SDD
title: #p freq=noraman PBEPBE/SDD
converged: YES YES NO NO
title: Mulliken charges:
elementType: O O N C C C C C C C C C C C C H H H H H H H H H H H H H H H H H H H
charge: -0.264226 -0.220234 -0.002506 0.068619 0.305182 -0.462524 -0.346533 -0.246737 -0.346520 -0.750981 -0.830423 0.230360 -0.693704 -0.203292 -0.500760 0.208760 0.201673 0.191858 0.205016 0.224981 0.197928 0.194464 0.236463 0.239476 0.248261 0.252690 0.223687 0.269683 0.210996 0.209926 0.218559 0.249410 0.244730 0.235717
chargesum: 0.00000
title: Mulliken charges with hydrogens summed into heavy atoms:
elementType: O O N C C C C C C C C C C C C
charge: -0.264226 -0.220234 -0.002506 0.068619 0.305182 -0.052090 0.050341 -0.021757 0.045872 -0.026780 -0.084362 0.230360 -0.054223 -0.203292 0.229098
polarizability: 1.72260374e+02 9.33916066e+00 1.35432737e+02 9.80481604e+00 5.53745110e+00 1.18867491e+02
1716.lowfreq: -8.5876 -0.0004 -0.0002 0.0002 6.7286 8.2707 14.4034 33.6019 44.0235
frequency: 13.7589 33.5748 44.0060 59.2098 67.8929 94.6381 105.0630 114.0801 128.6245 137.3491 155.6129 187.3668 212.1219 223.4220 227.2897 249.0994 285.5595 286.3290 313.0532 347.9537 367.8503 411.6834 437.7994 445.2897 492.3321 497.1140 582.0960 638.8419 688.4282 726.2448 731.8744 784.8189 814.1108 861.0502 880.5405 897.7326 924.1542 943.3737 963.5548 1008.0977 1049.7617 1055.8972 1066.6717 1076.9547 1094.3692 1103.5090 1113.9523 1114.2378 1148.5890 1156.3439 1182.5882 1201.3242 1212.9350 1249.0897 1274.1563 1288.1404 1315.7562 1347.9007 1359.0544 1388.6209 1394.1020 1408.7126 1422.2550 1452.1071 1458.2257 1462.9087 1465.5568 1467.1833 1468.8197 1474.8853 1477.0080 1483.4722 1486.7790 1488.2436 1626.2049 1674.8271 2195.6825 2955.9380 2962.0050 2970.7686 2973.2096 2981.2812 3002.8941 3008.5918 3011.7233 3026.0703 3049.1316 3056.3236 3069.9469 3073.2280 3101.3388 3106.7200 3110.3575 3112.9966 3131.2397 3155.0709
redmass: 3.2421 3.4012 4.3266 1.8506 3.5385 1.3368 2.2682 2.7256 3.4090 1.8431 1.8724 3.5349 2.3581 3.2953 1.1913 2.6473 2.7113 1.3944 3.0298 3.6487 3.9991 3.0403 6.8419 5.1077 2.8667 4.0275 5.3586 3.7817 3.8492 1.3319 2.7353 1.4011 2.5819 2.0735 2.1253 1.7049 1.3924 2.9521 2.1338 3.4904 1.4582 1.8822 2.5008 1.9312 2.6222 2.0610 3.2842 1.2835 1.6104 2.2729 2.7028 3.7397 1.5307 1.3111 1.1828 1.0687 1.3626 1.5633 1.3889 1.2134 1.1740 1.2333 1.1782 1.0498 1.0802 1.0511 1.0667 1.0526 1.0509 1.0674 1.0437 1.0666 1.0590 1.0758 10.0451 6.9433 12.6586 1.0652 1.0593 1.0609 1.0364 1.0389 1.0976 1.0293 1.0353 1.0983 1.0987 1.0966 1.1008 1.0992 1.0962 1.0962 1.0941 1.1048 1.1002 1.1052
irintensity: 0.7130 1.7431 0.6270 0.2855 0.5771 0.4193 0.3939 0.4320 1.8815 0.4171 0.2136 6.8385 1.1244 4.6160 0.4535 3.9370 0.2017 2.4399 6.7108 0.5279 4.0717 3.7582 2.5941 1.3293 4.6484 3.3493 3.7082 4.8172 7.8452 12.4670 0.9541 1.4714 3.8352 5.8998 9.0146 5.8613 6.7849 2.9260 0.6186 2.5108 5.9225 21.5256 9.0051 106.6059 93.4066 3.1607 54.0376 0.8596 45.3264 28.8177 3.8393 57.6556 3.3175 1.9206 0.8797 0.2871 0.4736 0.6767 5.1847 11.4234 11.0249 29.7087 19.1495 16.0186 3.9011 12.2168 4.9171 9.4811 10.1104 6.4125 14.1526 4.0438 33.5115 9.9739 165.0776 1.8641 6.3160 14.2257 0.5787 71.4539 46.9405 14.0503 3.1190 29.3656 11.5131 13.2808 32.5164 7.2967 88.8460 53.0176 12.3398 34.8614 11.6500 22.9991 10.8340 12.1451
temp: 298.150 k
press: 1.00000 atm
elementType: 8 8 7 6 6 6 6 6 6 6 6 6 6 6 6 1 1 1 1 1 1 1 1 1 1 1 1 1 1 1 1 1 1 1
symmnumber: 1
zpe: 747358.9 jmol-1
zpe.correction: 0.284654 hartree
zpe.thermalcorrener: 0.303428 hartree
zpe.thermalcorrenthalpy: 0.304372 hartree
zpe.thermalcorrgfe: 0.235594 hartree
zpe.sumelectzpe: -672.658408 hartree
zpe.sumelectthermal: -672.639634 hartree
zpe.sumelectthermalent: -672.638690 hartree
zpe.sumelectthermalfe: -672.707468 hartree
dipole: 4.3423 3.5333 1.7532
dipole: 5.8663
quadrupole: -105.8359 -89.1294 -91.1576
quadrupole: -14.5585 -6.3198 -0.2087
quadrupole: -10.4616 6.2450 4.2167 -14.5585 -6.3198 -0.2087
hfenergy: -672.9430623 hartree
pointgroup: C01[X(C12H19N1O2)]
dipole: -1.7429008 -1.2600035 0.8374916 debye
polarizability: 172.7638348|7.3081393|133.5457772|-10.6030024|-7.0496658|120.2509892 unknown
InChI: InChI=1S/C12H19NO2/c1-5-6-7-8-10(2)12(3,9-13)11(14)15-4/h8H,5-7H2,1-4H3
charge 0 multiplicity 1
34 atoms
O  1.469046 -2.037679 0.685107
O  2.458081 -1.247044 -1.264416
N  3.48394 2.109967 -0.322833
C  1.582858 0.378092 0.419912
C  0.225931 0.788937 -0.255237
C  -2.327927 1.071109 -0.021092
C  -3.323191 -0.106385 0.16936
C  -0.932704 0.736114 0.460044
C  -4.770556 0.269096 -0.222652
C  1.566431 0.378574 1.974008
C  0.335584 1.199479 -1.712376
C  1.918666 -1.029168 -0.158378
C  -5.76331 -0.898981 -0.040273
C  2.644395 1.320001 -0.019218
C  1.641467 -3.420611 0.170669
H  -2.328716 1.385666 -1.080508
H  -2.70645 1.939308 0.560282
H  -3.304322 -0.437783 1.228385
H  -2.985936 -0.972261 -0.435117
H  -0.889849 0.416263 1.510374
H  -4.786011 0.608989 -1.27826
H  -5.098887 1.135507 0.387414
H  1.259298 1.371076 2.343466
H  2.572642 0.151642 2.363858
H  0.877363 -0.388863 2.355364
H  0.779059 2.209094 -1.806191
H  -0.646733 1.213828 -2.210006
H  0.996719 0.511059 -2.270335
H  -5.473973 -1.766699 -0.662609
H  -5.790071 -1.236158 1.013145
H  -6.789789 -0.605452 -0.326781
H  2.70739 -3.621145 -0.026805
H  1.067377 -3.550238 -0.761865
H  1.253976 -4.065334 0.971267
