program: Gaussian 09
title: 000278365
version: EM64L-G09RevD.01
frameworkgroup: C1[X(C15H17NO2)]
method: RPBEPBE
basis: SDD
operation: Freq
keyword: #p
keyword: freq=noraman
keyword: PBEPBE/SDD
title: #p freq=noraman PBEPBE/SDD
converged: YES YES NO NO
title: Mulliken charges:
elementType: O O N C C C C C C C C C C C C C C C H H H H H H H H H H H H H H H H H
charge: -0.264606 -0.258038 -0.022046 -0.538027 0.323043 -0.370905 0.337929 -0.019050 -0.689605 -0.371747 -0.397079 -0.226513 -0.236131 0.160495 -0.232532 -0.210567 -0.257496 -0.666327 0.208759 0.259164 0.212030 0.238055 0.207347 0.223779 0.225289 0.263546 0.235732 0.235959 0.231611 0.235298 0.232295 0.230776 0.218703 0.234592 0.246266
chargesum: 0.00000
title: Mulliken charges with hydrogens summed into heavy atoms:
elementType: O O N C C C C C C C C C C C C C C C
charge: -0.264606 -0.258038 -0.022046 -0.070104 0.323043 0.079181 0.337929 -0.019050 -0.033190 -0.108201 -0.161347 0.009446 -0.004520 0.160495 0.002766 -0.210567 0.205576 0.033235
polarizability: 2.51745790e+02 -2.11732151e+00 1.77240982e+02 8.26716089e+00 1.69782808e+01 1.24928476e+02
1716.lowfreq: -7.6342 -0.0003 0.0004 0.0005 3.2819 7.8049 29.6929 35.6582 42.6933
frequency: 29.6590 35.6480 42.6367 59.4255 62.2251 77.1330 88.0067 95.8731 124.5020 142.8279 184.5949 219.8382 229.2970 238.8312 258.8275 268.6547 290.1948 320.6039 345.7610 396.9977 403.7057 438.3861 488.2486 509.0852 522.1040 567.4620 612.1919 629.0612 669.4029 701.3740 724.1937 744.3267 752.0731 771.1228 787.2364 817.9525 848.0872 850.0949 882.6933 904.1043 929.0299 977.7346 988.0845 999.7493 1006.1735 1026.3000 1045.5376 1058.1836 1068.8376 1077.9562 1096.3935 1098.0953 1130.5993 1156.4364 1176.4406 1197.0334 1210.5986 1234.2886 1273.0785 1279.7058 1286.0200 1301.8350 1325.2599 1328.1455 1355.5890 1375.1996 1386.9034 1392.4152 1431.0554 1453.1038 1458.0386 1464.3965 1469.5176 1474.6540 1480.2875 1483.7204 1484.7728 1552.6438 1581.0867 1604.9797 1607.5661 2168.6565 2975.6972 2992.2284 2994.2323 3006.3653 3030.1126 3047.8873 3074.8377 3078.8342 3089.8059 3094.4713 3095.6610 3121.3239 3129.1530 3137.1075 3148.4786 3158.7998 3171.5188
redmass: 4.2700 4.4978 3.2358 3.6845 5.0726 2.8493 4.5686 2.1903 4.0554 4.6137 3.0798 2.3904 1.2640 1.7586 5.2777 5.2163 3.3316 3.1370 3.2947 3.9525 2.8498 3.9366 4.3787 7.5030 8.4053 5.4601 6.2505 5.3445 5.3274 1.6431 3.4064 1.2917 3.8312 2.7867 2.6984 1.4349 1.9160 1.2537 2.0772 1.7217 1.4268 1.3924 5.8332 1.3402 2.6701 2.5062 3.3384 2.9853 2.9139 2.0176 2.1480 2.0759 2.1346 1.7022 1.0550 1.1421 5.8410 1.4450 1.2611 1.1251 1.6893 1.4614 1.4444 1.4213 1.2801 6.1423 1.2102 1.2307 2.2975 1.1610 1.1007 1.0426 1.0720 1.0508 2.1790 1.0633 1.0523 7.1926 5.8246 7.4383 6.7139 12.6412 1.0355 1.0604 1.0361 1.0634 1.0599 1.0978 1.0988 1.1002 1.0977 1.1012 1.1025 1.1061 1.0854 1.0879 1.0925 1.0963 1.1014
irintensity: 2.3769 0.9041 0.0802 1.1050 0.6690 0.2210 0.5203 0.1878 1.4090 1.7404 2.4523 1.4539 0.4669 0.6907 1.7059 2.3740 0.4407 11.7176 10.5887 4.0992 2.9166 5.3676 7.3742 1.8634 0.5968 1.3872 0.8206 4.2881 3.7876 49.8402 7.6937 18.8937 24.1609 6.1148 25.3729 2.6616 4.3144 2.4537 2.8593 11.0241 1.7247 2.0205 3.6325 0.0640 24.7553 4.3721 1.1351 258.4102 44.8885 42.7920 25.0981 12.7979 51.8038 60.9629 0.4927 10.0598 301.5063 20.2665 3.9141 7.5518 16.9122 3.6741 4.1425 6.3644 2.2866 1.3679 10.5353 24.7344 10.1651 42.8079 7.5783 13.8766 3.5941 13.4962 7.6570 12.1686 14.3827 202.0651 20.7497 122.6512 43.9752 17.7382 38.9525 16.9685 20.4931 22.3308 32.6447 1.0849 42.9563 30.4650 37.2895 21.6811 2.8376 28.9538 1.5854 1.0673 17.5363 25.4855 17.1549
temp: 298.150 k
press: 1.00000 atm
elementType: 8 8 7 6 6 6 6 6 6 6 6 6 6 6 6 6 6 6 1 1 1 1 1 1 1 1 1 1 1 1 1 1 1 1 1
symmnumber: 1
zpe: 741547.5 jmol-1
zpe.correction: 0.282441 hartree
zpe.thermalcorrener: 0.301094 hartree
zpe.thermalcorrenthalpy: 0.302038 hartree
zpe.thermalcorrgfe: 0.233664 hartree
zpe.sumelectzpe: -785.653837 hartree
zpe.sumelectthermal: -785.635184 hartree
zpe.sumelectthermalent: -785.634240 hartree
zpe.sumelectthermalfe: -785.702614 hartree
dipole: 1.0044 2.9402 0.5525
dipole: 3.1558
quadrupole: -81.9904 -121.5116 -101.4905
quadrupole: 1.1928 1.2402 1.9808
quadrupole: 19.6738 -19.8474 0.1737 1.1928 1.2402 1.9808
hfenergy: -785.9362775 hartree
pointgroup: C01 [X(C15H17N1O2)]
dipole: -0.3929159 -1.0512761 0.5309684 debye
polarizability: 251.5235489|-4.954586|164.3787542|-8.7958618|-28.140193|138.0129449 unknown
InChI: InChI=1S/C15H17NO2/c1-3-8-13(12-9-6-5-7-10-12)14(11-16)15(17)18-4-2/h5-7,9-10H,3-4,8H2,1-2H3
charge 0 multiplicity 1
35 atoms
O  3.046779 0.917652 -0.618247
O  2.576781 -1.224743 0.169098
N  0.45228 2.807584 -1.282801
C  -0.151744 -1.663229 0.95493
C  -0.314443 -0.321779 0.266311
C  -0.276336 -2.841465 -0.063474
C  -1.714566 0.173696 0.11248
C  0.76342 0.401731 -0.243132
C  -0.166976 -4.207804 0.643064
C  -2.195863 0.648592 -1.14015
C  -2.613877 0.144179 1.216349
C  -3.530549 1.079424 -1.28284
C  -3.941912 0.597688 1.077707
C  2.179468 -0.084992 -0.187943
C  -4.408025 1.062334 -0.174182
C  0.583621 1.713547 -0.816391
C  4.506477 0.592817 -0.618258
C  5.12099 0.870338 0.756468
H  -0.950926 -1.786268 1.709353
H  0.827608 -1.748736 1.450763
H  -1.242998 -2.765367 -0.598269
H  0.529031 -2.74343 -0.813884
H  -0.966087 -4.335923 1.397512
H  -0.253225 -5.035424 -0.084292
H  0.807009 -4.307739 1.15622
H  -1.530033 0.658711 -2.008741
H  -2.264236 -0.198225 2.196512
H  -3.883347 1.430782 -2.258237
H  -4.611439 0.589327 1.944566
H  -5.442233 1.406392 -0.284171
H  4.631998 -0.464441 -0.911417
H  4.913493 1.257822 -1.396126
H  6.215556 0.719584 0.710566
H  4.928297 1.910905 1.068736
H  4.710808 0.184862 1.516815
