program: Gaussian 09
title: 000278362
version: EM64L-G09RevD.01
frameworkgroup: C1[X(C11H17NO2)]
method: RPBEPBE
basis: SDD
operation: Freq
keyword: #p
keyword: freq=noraman
keyword: PBEPBE/SDD
title: #p freq=noraman PBEPBE/SDD
converged: YES YES NO NO
title: Mulliken charges:
elementType: O O N C C C C C C C C C C C H H H H H H H H H H H H H H H H H
charge: -0.266443 -0.221693 -0.006364 0.104688 -0.428995 0.343292 0.216610 -0.724413 -0.824886 -0.254792 -0.223884 -0.747742 -0.261161 -0.663969 0.226514 0.229964 0.247744 0.218768 0.225172 0.267321 0.219818 0.252882 0.222275 0.225123 0.227548 0.231152 0.237410 0.225573 0.221679 0.225753 0.255056
chargesum: 0.00000
title: Mulliken charges with hydrogens summed into heavy atoms:
elementType: O O N C C C C C C C C C C C
charge: -0.266443 -0.221693 -0.006364 0.104688 0.027483 0.343292 0.216610 -0.032730 -0.084865 -0.032516 -0.223884 -0.063918 0.201822 0.038519
polarizability: 1.36692026e+02 -4.66412862e+00 1.29817244e+02 1.57684846e+00 -1.35713818e+01 1.21395708e+02
1716.lowfreq: -12.9527 -11.0087 -5.1828 0.0007 0.0009 0.0010 23.5903 37.2243 55.7200
frequency: 21.4267 37.1458 55.6764 87.3019 98.8342 106.9266 115.8699 128.6522 140.0635 160.9300 173.6947 184.3711 217.7941 237.9474 266.5499 283.8250 321.8795 355.0169 358.7967 385.3977 430.1286 442.1625 467.4823 497.3180 592.1292 624.6875 685.6341 722.3720 774.2131 811.1009 815.4585 842.7099 858.4502 930.9779 967.0799 975.9997 1011.1720 1016.2290 1040.6822 1049.7532 1077.9768 1088.7985 1093.6173 1100.6636 1139.0381 1155.7477 1176.3599 1193.4091 1276.4105 1286.8025 1319.8937 1353.3421 1361.4766 1389.9110 1393.5612 1398.5274 1409.3105 1455.5375 1461.1499 1462.6030 1463.8640 1467.2897 1469.4921 1480.1229 1483.3855 1484.5703 1485.0071 1621.1923 1682.6203 2194.0649 2970.6930 2981.9731 2986.8036 2993.6541 3013.5366 3032.0106 3038.7980 3055.9449 3072.8189 3082.5030 3088.3966 3095.2548 3095.3256 3097.0511 3103.5607 3121.4632 3126.8160
redmass: 3.3035 3.1829 3.2696 4.2728 1.1288 3.2906 1.9157 3.1447 1.6111 3.0583 3.0828 1.4287 1.3125 2.8903 1.7633 2.8478 2.9473 3.2598 3.4533 4.1949 5.2206 4.4035 5.1263 3.4684 4.2535 3.3920 5.2662 3.0079 1.5977 1.4620 1.8932 1.3897 3.4908 2.0432 1.7728 2.0584 2.6077 2.0120 1.5064 1.4928 2.3394 3.5671 2.3332 2.6850 3.0361 1.6948 2.7575 3.2115 1.1175 1.2606 1.4036 1.2677 1.2774 1.2302 1.2658 1.2048 1.2196 1.0965 1.0557 1.0742 1.0430 1.0518 1.0472 1.0399 1.0514 1.0515 1.0703 9.9316 6.3812 12.6575 1.0386 1.0388 1.0358 1.0360 1.0620 1.0595 1.0967 1.0968 1.0989 1.0991 1.0975 1.1029 1.0963 1.1020 1.0954 1.1066 1.0899
irintensity: 0.4799 0.2002 0.8645 0.3055 0.3965 1.4035 1.1183 0.5162 0.1550 4.8291 1.9422 1.4077 1.5840 2.6237 1.6535 0.3232 11.3982 1.5051 0.7332 1.6460 2.7556 3.9451 1.1535 5.4468 3.2822 3.3952 5.8565 9.7961 5.3873 11.9752 2.7979 17.3168 1.3177 5.6825 9.0612 8.5583 54.3664 15.7141 0.4597 0.8597 101.9510 1.8855 89.4305 115.4123 67.6406 7.7500 12.3515 59.4273 3.3145 6.6113 2.9928 0.8586 4.6329 20.5895 4.3301 22.4684 28.3157 11.7731 1.2484 12.0598 15.8965 18.4676 19.1022 5.3662 20.0760 4.6338 20.5552 146.9326 2.4479 5.0700 35.9314 15.3856 23.6425 16.4715 16.4683 25.9158 21.0640 7.9018 3.1536 35.2368 33.2772 1.9930 11.2141 27.1649 23.1385 25.7334 29.3880
temp: 298.150 k
press: 1.00000 atm
elementType: 8 8 7 6 6 6 6 6 6 6 6 6 6 6 1 1 1 1 1 1 1 1 1 1 1 1 1 1 1 1 1
symmnumber: 1
zpe: 673953.3 jmol-1
zpe.correction: 0.256695 hartree
zpe.thermalcorrener: 0.274065 hartree
zpe.thermalcorrenthalpy: 0.275009 hartree
zpe.thermalcorrgfe: 0.210722 hartree
zpe.sumelectzpe: -633.442329 hartree
zpe.sumelectthermal: -633.424959 hartree
zpe.sumelectthermalent: -633.424014 hartree
zpe.sumelectthermalfe: -633.488302 hartree
dipole: -0.8864 -4.5982 3.3682
dipole: 5.7684
quadrupole: -74.2641 -92.1178 -88.3855
quadrupole: -1.6328 -0.4302 6.9679
quadrupole: 10.6584 -7.1954 -3.4630 -1.6328 -0.4302 6.9679
hfenergy: -633.6990238 hartree
pointgroup: C01 [X(C11H17N1O2)]
dipole: 0.9026453 -1.8117331 -1.0263064 debye
polarizability: 132.3597287|5.497428|138.4251589|-5.1175127|9.4981941|117.1200908 unknown
InChI: InChI=1S/C11H17NO2/c1-5-9(4)11(6-2,8-12)10(13)14-7-3/h5H,6-7H2,1-4H3
charge 0 multiplicity 1
31 atoms
O  1.791079 -0.58826 -0.433038
O  1.295471 0.607625 1.503307
N  -1.675818 2.473512 0.668183
C  -0.478299 0.25058 -0.218269
C  -0.44478 0.3375 -1.780504
C  -1.254859 -0.989646 0.352661
C  0.954067 0.152645 0.389796
C  0.241683 1.607476 -2.322801
C  -1.659963 -0.872509 1.811208
C  -1.494484 -2.072237 -0.43895
C  -1.119394 1.485582 0.300141
C  -2.210128 -3.346322 -0.051874
C  3.177819 -0.839613 0.081593
C  4.103651 0.329246 -0.262491
H  -1.489759 0.287144 -2.138773
H  0.089289 -0.549539 -2.158993
H  -0.268154 2.525931 -1.982357
H  0.225295 1.60133 -3.427367
H  1.298725 1.659549 -2.004754
H  -0.836398 -0.456192 2.420294
H  -1.944505 -1.846522 2.23919
H  -2.518463 -0.184324 1.930073
H  -1.14921 -2.049994 -1.48025
H  -2.542958 -3.357791 0.998219
H  -1.556001 -4.225258 -0.2148
H  -3.103337 -3.495036 -0.689833
H  3.119247 -1.000846 1.172183
H  3.471698 -1.770416 -0.428764
H  5.135702 0.088103 0.052928
H  4.112746 0.520745 -1.3495
H  3.790239 1.246435 0.263244
