program: Gaussian 09
title: 000278364
version: EM64L-G09RevD.01
frameworkgroup: C1[X(C13H21NO2)]
method: RPBEPBE
basis: SDD
operation: Freq
keyword: #p
keyword: freq=noraman
keyword: PBEPBE/SDD
title: #p freq=noraman PBEPBE/SDD
converged: YES YES NO NO
title: Mulliken charges:
elementType: O O N C C C C C C C C C C C C C H H H H H H H H H H H H H H H H H H H H H
charge: -0.268050 -0.217246 -0.005629 0.114210 0.308771 -0.420669 -0.474104 -0.230182 -0.378094 0.204069 -0.850440 -0.350109 -0.725485 -0.224415 -0.687572 -0.502217 0.228838 0.225678 0.210066 0.216883 0.213535 0.186628 0.199777 0.238054 0.253336 0.269506 0.196818 0.213536 0.218778 0.246991 0.225932 0.207452 0.218537 0.208262 0.248821 0.235300 0.244438
chargesum: 0.00000
title: Mulliken charges with hydrogens summed into heavy atoms:
elementType: O O N C C C C C C C C C C C C C
charge: -0.268050 -0.217246 -0.005629 0.114210 0.308771 0.033846 -0.047155 -0.016647 0.008310 0.204069 -0.089545 0.060245 -0.033784 -0.224415 -0.053322 0.226342
polarizability: 1.73048410e+02 -9.39710097e+00 1.43594063e+02 6.30288615e+00 -7.49234950e+00 1.38443985e+02
1716.lowfreq: -11.5881 -9.6642 -0.0006 -0.0004 0.0007 3.6022 16.7388 33.3081 46.5841
frequency: 14.5316 33.2516 46.4206 49.9472 74.5838 92.9305 101.4917 107.5796 110.0353 130.6317 143.0710 144.0311 183.5183 195.8155 219.1337 228.3443 233.7806 257.1545 265.5680 278.6028 318.0114 346.8352 369.9550 413.8889 432.4526 462.3378 480.8583 486.3742 597.6011 634.8238 705.5354 728.6574 738.2485 776.4921 787.6323 835.3103 857.2162 871.4834 908.3049 942.1912 948.6148 979.0668 984.5317 1010.6630 1045.0346 1048.9827 1075.9889 1084.9627 1096.7410 1104.0339 1114.3024 1115.1285 1140.1652 1151.5709 1171.0177 1193.4926 1208.2105 1236.8129 1287.1762 1289.2605 1305.4939 1313.2293 1324.4914 1357.3773 1361.6331 1390.2753 1397.7732 1407.1705 1422.4583 1449.4531 1452.0451 1459.7328 1463.9925 1464.7118 1466.9070 1473.8510 1477.9624 1479.2780 1481.0434 1483.6331 1486.2543 1626.8123 1671.0060 2194.7971 2948.2534 2963.0228 2972.2616 2972.9399 2979.2471 2987.2467 3004.0240 3007.8735 3011.8354 3019.4661 3034.8883 3052.8998 3069.0434 3072.0483 3073.2232 3082.7737 3096.3350 3103.3052 3111.3402 3111.8611 3153.9760
redmass: 3.7157 3.6911 3.3614 4.6047 1.6408 1.6270 2.4031 1.7001 2.0087 3.0339 1.9056 3.4873 2.1729 2.0925 2.5310 1.3002 2.5945 2.3848 1.9675 2.8680 3.0880 3.3477 3.7490 5.4311 5.1369 6.0407 2.6433 3.4386 4.3070 4.2201 4.5856 1.8317 1.6633 1.7043 1.4402 1.8059 1.6792 2.3616 3.2418 1.6487 1.9230 2.3848 2.2808 2.0560 2.4089 1.4604 2.0652 2.2180 2.9633 2.1233 1.5409 1.8363 2.6329 1.5611 2.6035 3.1149 1.3833 1.3510 1.2126 1.2117 1.2972 1.2740 1.3577 1.5022 1.4788 1.2137 1.2054 1.2209 1.1748 1.0796 1.0501 1.0724 1.0690 1.0576 1.0546 1.0651 1.0434 1.0596 1.0396 1.0512 1.0770 10.0687 7.2623 12.6572 1.0637 1.0615 1.0595 1.0373 1.0389 1.0358 1.0971 1.0294 1.0619 1.0962 1.1017 1.0967 1.1006 1.0993 1.0993 1.0990 1.1020 1.0964 1.0891 1.1047 1.1051
irintensity: 0.9836 0.2527 0.2427 1.1210 0.0623 0.5934 1.0314 0.2698 0.9009 0.6587 0.6618 0.4396 5.5035 4.5316 2.9830 0.6110 0.1914 2.9807 1.8135 1.3784 8.5061 0.9536 2.0570 0.3437 4.3266 1.8025 0.5645 6.2101 2.2118 6.0616 3.1978 7.9108 7.2021 3.2557 13.4902 1.8112 11.7940 3.3622 2.4150 2.5619 9.6948 11.5510 11.2856 9.8317 8.9727 0.9611 3.6008 45.4525 106.8826 5.5609 19.9491 43.6355 69.4330 1.7731 4.3906 61.3861 1.4353 1.0245 1.8746 4.0123 0.0099 0.6902 2.6242 2.7130 7.1115 12.4066 17.4482 30.9263 15.8123 10.8711 13.7255 11.2651 8.3989 7.6426 10.7170 2.8174 13.9417 15.2837 8.9788 6.7240 14.2392 166.2924 1.4588 5.2522 21.6547 14.0442 76.3390 34.0258 11.3269 26.1644 6.2374 32.2442 17.9196 19.1057 52.3351 5.9398 84.7053 1.8648 44.1829 31.6180 29.3954 17.1622 23.8760 19.2207 12.1183
temp: 298.150 k
press: 1.00000 atm
elementType: 8 8 7 6 6 6 6 6 6 6 6 6 6 6 6 6 1 1 1 1 1 1 1 1 1 1 1 1 1 1 1 1 1 1 1 1 1
symmnumber: 1
zpe: 820217.4 jmol-1
zpe.correction: 0.312404 hartree
zpe.thermalcorrener: 0.332615 hartree
zpe.thermalcorrenthalpy: 0.333560 hartree
zpe.thermalcorrgfe: 0.261765 hartree
zpe.sumelectzpe: -711.881102 hartree
zpe.sumelectthermal: -711.860891 hartree
zpe.sumelectthermalent: -711.859947 hartree
zpe.sumelectthermalfe: -711.931741 hartree
dipole: 2.7120 -4.3629 2.5940
dipole: 5.7548
quadrupole: -101.7207 -102.0339 -97.0937
quadrupole: 11.7922 -11.0783 3.4617
quadrupole: -1.4379 -1.7512 3.1891 11.7922 -11.0783 3.4617
hfenergy: -712.1935066 hartree
pointgroup: C01 [X(C13H21N1O2)]
dipole: -1.4510246 1.7182337 -0.2616536 debye
polarizability: 176.182366|-6.1288036|145.4285571|-2.9570916|-1.0137727|133.4755345 unknown
InChI: InChI=1S/C13H21NO2/c1-5-7-8-9-11(3)13(6-2,10-14)12(15)16-4/h9H,5-8H2,1-4H3
charge 0 multiplicity 1
37 atoms
O  1.591783 2.10428 -0.555692
O  2.790246 0.369957 -1.535809
N  2.61756 -2.286783 0.918506
C  1.158394 -0.13459 0.287502
C  -0.088982 -0.600628 -0.544155
C  0.807456 0.595224 1.626018
C  -2.579459 -0.317483 -1.126098
C  -1.302026 -0.009472 -0.362433
C  -3.859792 0.046396 -0.332827
C  1.966752 0.77181 -0.686445
C  0.183006 -1.689086 -1.567187
C  -4.083853 -0.833086 0.919078
C  2.036872 0.972125 2.477408
C  1.987773 -1.322972 0.60988
C  -5.356739 -0.444332 1.700623
C  2.213211 3.039014 -1.527791
H  0.247753 1.512233 1.378715
H  0.135142 -0.070381 2.19875
H  -2.619561 -1.386975 -1.409265
H  -2.576544 0.254436 -2.079416
H  -1.399009 0.793522 0.380822
H  -3.812881 1.113239 -0.028369
H  -4.739056 -0.04747 -1.001739
H  -0.644498 -1.787577 -2.286949
H  0.332845 -2.669963 -1.076848
H  1.108623 -1.476671 -2.134229
H  -4.147479 -1.895609 0.607356
H  -3.200429 -0.760282 1.58463
H  1.711452 1.473564 3.406387
H  2.626641 0.083023 2.762618
H  2.700147 1.670516 1.936086
H  -5.303488 0.60444 2.049569
H  -5.499608 -1.088655 2.587287
H  -6.257414 -0.539718 1.064962
H  3.312106 2.993541 -1.450607
H  1.832228 4.029555 -1.243862
H  1.909228 2.772658 -2.553873
