program: Gaussian 09
title: 000278342
version: EM64L-G09RevD.01
frameworkgroup: C1[X(C6H8O4)]
method: RPBEPBE
basis: SDD
operation: Freq
keyword: #p
keyword: freq=noraman
keyword: PBEPBE/SDD
title: #p freq=noraman PBEPBE/SDD
converged: YES YES NO NO
title: Mulliken charges:
elementType: O O O O C C C C C C H H H H H H H H
charge: -0.410405 -0.397202 -0.245484 -0.240642 -0.438983 -0.183135 0.171437 -0.665722 0.136615 0.090190 0.216162 0.245363 0.266343 0.225987 0.248407 0.215053 0.384025 0.381991
chargesum: 0.00000
title: Mulliken charges with hydrogens summed into heavy atoms:
elementType: O O O O C C C C C C
charge: -0.026381 -0.015211 -0.245484 -0.240642 0.022542 0.083208 0.171437 0.023726 0.136615 0.090190
polarizability: 1.06045436e+02 -3.83464719e+00 8.23877698e+01 -1.80641458e+00 4.85032411e+00 5.24618289e+01
1716.lowfreq: -6.1819 -3.6219 -0.0010 -0.0009 -0.0009 6.6432 31.4919 43.9988 76.1157
frequency: 31.4610 43.9894 76.1143 111.8943 182.8414 186.3704 227.3870 246.0748 371.9157 393.5793 414.4260 454.4549 511.5686 576.5818 607.8816 621.2276 692.3851 722.6476 763.0840 809.4920 906.5765 941.8201 985.2830 1012.3054 1061.4898 1076.6667 1115.0091 1175.5950 1255.5426 1274.7539 1301.3666 1322.5604 1366.8442 1387.7477 1466.1191 1474.6534 1485.8975 1624.9225 1635.4315 1648.3882 2988.8951 2990.9129 3072.5706 3089.6496 3100.7572 3108.2204 3512.6183 3523.7677
redmass: 3.3381 6.3608 10.1674 3.6457 2.1463 3.5065 3.6039 1.7508 4.3761 4.6478 4.3529 2.9093 3.2785 1.3428 1.4687 3.1538 4.0737 4.0655 6.9406 1.3197 2.3598 1.3866 3.7214 2.9875 1.7753 1.9317 1.9865 2.0950 1.2483 1.5782 1.5124 2.3727 1.7582 1.2685 1.0915 1.0530 1.0685 8.3181 8.4476 8.3297 1.0396 1.0592 1.0964 1.0980 1.0965 1.0970 1.0640 1.0642
irintensity: 1.1404 2.3652 0.2636 0.3453 1.1239 0.1994 4.6454 1.6186 11.3303 4.1947 2.1420 8.5691 9.1731 81.1036 233.3200 35.8981 16.4740 14.8992 15.2000 20.6385 47.3544 14.8425 56.4594 159.5820 9.2420 235.9708 174.7372 3.6937 1.4923 7.8031 33.3184 53.6590 43.5168 6.5632 10.2609 11.1767 11.6478 314.4809 136.6176 153.6116 35.3333 19.4299 1.4800 28.3856 15.5791 19.9644 35.2944 43.6473
temp: 298.150 k
press: 1.00000 atm
elementType: 8 8 8 8 6 6 6 6 6 6 1 1 1 1 1 1 1 1
symmnumber: 1
zpe: 352609.7 jmol-1
zpe.correction: 0.134302 hartree
zpe.thermalcorrener: 0.145178 hartree
zpe.thermalcorrenthalpy: 0.146122 hartree
zpe.thermalcorrgfe: 0.096368 hartree
zpe.sumelectzpe: -533.561064 hartree
zpe.sumelectthermal: -533.550187 hartree
zpe.sumelectthermalent: -533.549243 hartree
zpe.sumelectthermalfe: -533.598998 hartree
dipole: 0.5586 0.4568 -0.2924
dipole: 0.7786
quadrupole: -49.0698 -59.9581 -59.8978
quadrupole: -6.5438 -5.2702 -5.0329
quadrupole: 7.2388 -3.6495 -3.5892 -6.5438 -5.2702 -5.0329
hfenergy: -533.6953656 hartree
pointgroup: C01 [X(C6H8O4)]
dipole: -0.2398587 0.1347577 0.1346683 debye
dipolederiv: -0.8412234 -0.4316225 0.2687433 -0.4019544 -0.5763957 0.2083274 0.3350563 0.2422885 -0.5792604 -0.7457976 -0.3334619 -0.2736794 -0.437199 -0.5456152 -0.2946687 -0.345695 -0.3172006 -0.6458583 -0.7118112 0.2625896 0.0427307 0.2530056 -0.9236196 0.1572499 0.1098764 0.1021317 -0.390715 -0.6889407 0.0882286 -0.2769986 0.1986861 -0.7526986 0.1234596 -0.2669535 -0.0258599 -0.4724046 -0.3024389 -0.033085 -0.0444332 -0.0916157 0.0766062 -0.0063635 -0.1665771 -0.1043795 0.0506153 0.6839068 0.2500056 -0.0511381 0.197969 0.1066217 -0.050088 -0.1743333 0.026262 -0.1074468 -0.8295255 -0.0516015 0.0546827 -0.1559285 -0.4030694 -0.0123704 0.1082456 0.0485304 -0.0855967 0.0456615 -0.0231416 -0.016345 0.0962044 0.1196237 0.0021703 0.18076 0.0565546 0.0383424 1.6778139 -0.049757 -0.4344316 -0.1936149 1.1883631 -0.3439767 -0.5039025 -0.3713504 0.5369963 1.0302745 0.1158059 0.6469977 0.1957806 1.4187436 0.1782589 0.6912438 0.2407012 0.7035324 0.0100693 -0.0353363 0.0465065 0.0090892 0.0324633 0.1106262 0.0741653 0.096506 -0.0543643 0.0600922 -0.0080918 -0.0160601 0.045202 -0.0642786 -0.0898086 -0.0085679 -0.0456347 0.0509945 0.0844084 0.0134809 0.0089605 0.0396684 -0.0175399 -0.0127503 0.0314513 -0.0385091 0.1264185 -0.2096591 0.0097767 0.0193778 0.0392062 0.0956219 -0.0184598 -0.0071873 -0.0335414 0.0656974 0.0849133 -0.0467519 0.0536474 -0.022676 0.0231648 0.1072216 0.0053938 0.0697796 -0.0405775 0.0992843 0.0575063 -0.0065896 -0.0072641 -0.1390685 -0.0947691 -0.0145399 -0.0523356 0.0475435 0.2550973 0.1067754 0.0198547 0.1533713 0.2046208 -0.0015674 -0.0260808 0.0110708 0.3907522 0.2978751 0.1086806 -0.0418258 0.0820699 0.1564564 0.0375087 -0.0223551 0.0949865 0.3653311 unknown
polarizability: 104.6361873|6.8410486|84.5315306|-0.9287796|-1.2762064|51.7273171 unknown
InChI: InChI=1S/C6H8O4/c1-2-3-4(5(7)8)6(9)10/h3,7,9H,2H2,1H3
charge 0 multiplicity 1
18 atoms
O  2.43855 0.187656 -0.833276
O  1.055906 1.966258 0.910341
O  1.914354 -1.916114 -0.002795
O  -0.869382 2.006225 -0.38412
C  -2.249382 -0.631544 0.523929
C  -0.810082 -0.98461 0.270224
C  0.243551 -0.129619 0.080067
C  -3.115116 -0.913323 -0.740265
C  1.581648 -0.724808 -0.211674
C  0.068275 1.353948 0.134637
H  -2.623231 -1.258295 1.357759
H  -2.3644 0.427415 0.806288
H  -0.568191 -2.057315 0.21377
H  -4.179245 -0.720543 -0.517215
H  -2.806858 -0.251008 -1.566638
H  -3.018587 -1.962387 -1.074241
H  3.309923 -0.257196 -1.015091
H  0.916067 2.952258 0.896002
