program: Gaussian 09
title: 000278371
version: EM64L-G09RevD.01
frameworkgroup: C1[X(C14H23NO2)]
method: RPBEPBE
basis: SDD
operation: Freq
keyword: #p
keyword: freq=noraman
keyword: PBEPBE/SDD
title: #p freq=noraman PBEPBE/SDD
converged: YES YES NO NO
title: Mulliken charges:
elementType: O O N C C C C C C C C C C C C C C H H H H H H H H H H H H H H H H H H H H H H H
charge: -0.265554 -0.260522 -0.037530 -0.242341 -0.178951 0.463824 -0.355290 -0.390281 -0.747366 -0.733072 -0.044041 -0.717608 -0.683346 0.162817 -0.227843 -0.255753 -0.666012 0.282572 0.200031 0.191100 0.221465 0.198710 0.247017 0.224863 0.234377 0.210945 0.230339 0.218950 0.254086 0.227517 0.220613 0.214447 0.218847 0.218195 0.202415 0.231065 0.232781 0.218863 0.246157 0.233516
chargesum: 0.00000
title: Mulliken charges with hydrogens summed into heavy atoms:
elementType: O O N C C C C C C C C C C C C C C
charge: -0.265554 -0.260522 -0.037530 0.040231 0.021080 0.463824 0.057275 0.055446 -0.077182 -0.029698 -0.044041 -0.055032 -0.043889 0.162817 -0.227843 0.208093 0.032524
polarizability: 1.96410348e+02 -9.65586755e+00 1.80627372e+02 -6.09868810e+00 -3.81174648e-01 1.31733094e+02
1716.lowfreq: -20.0849 -8.2728 -3.7377 -0.0008 -0.0006 0.0004 10.6430 35.9673 44.7579
frequency: -17.0791 35.5977 44.7344 59.2569 61.5079 79.5725 84.1166 107.8315 132.0397 148.5466 168.6371 191.7954 197.1223 210.6385 215.8874 219.4599 232.7361 245.4612 259.0921 264.3587 279.5208 295.4547 329.5449 356.3123 370.9096 425.0838 437.9236 471.8755 490.9973 524.4254 541.6658 622.0871 679.7051 721.2287 761.0622 762.9478 777.2555 804.4980 815.1164 831.7124 844.2762 910.9716 952.7838 965.3362 974.8835 993.0654 1009.4364 1017.5017 1025.4019 1050.8144 1070.5005 1085.6919 1095.7045 1109.5634 1118.8536 1154.4342 1156.0155 1163.7125 1184.7787 1222.6265 1265.7818 1267.4181 1277.8498 1291.2282 1316.8667 1333.6068 1334.3048 1352.4726 1357.0893 1367.6187 1383.2430 1388.5510 1391.9622 1393.9572 1395.2664 1455.5718 1460.4093 1462.4379 1472.9132 1474.1125 1476.6237 1479.2622 1481.7006 1484.0671 1485.6458 1487.3334 1488.3092 1491.6516 1564.3732 1607.5126 2165.6633 2977.3458 2979.7952 2981.5612 2985.4692 2986.2446 2987.3989 2993.6716 2995.3836 3030.5137 3034.0589 3058.8556 3059.5106 3074.4886 3076.5306 3078.1956 3080.2245 3083.9920 3085.9358 3089.1834 3089.4481 3095.2715 3097.4287 3121.2234
redmass: 3.4076 3.5256 3.8056 2.8378 4.9930 1.9133 4.0255 3.1952 2.7313 4.4506 3.3759 1.8359 1.7567 1.2787 1.3405 1.2752 2.3863 2.0277 1.4996 1.5888 3.3752 2.3560 3.6740 2.9286 3.6518 3.3297 3.2025 3.7566 3.3881 5.8575 8.6590 3.0590 7.2130 3.0233 2.0296 4.3161 1.5150 1.5029 1.4715 1.9408 2.2617 2.3767 1.7508 1.2915 1.2720 1.9105 2.0687 2.2664 2.2577 3.2322 3.8605 2.6836 2.1728 2.5298 1.8494 2.2169 1.7017 2.1505 4.5517 3.9049 1.2578 1.2321 1.1188 1.2035 1.2986 1.2790 1.3110 1.2701 1.3655 1.3225 1.1932 1.2307 1.2072 1.2016 1.2105 1.0981 1.0662 1.0437 1.0565 1.0511 1.0566 1.0455 1.0426 1.0519 1.0577 1.0581 1.0654 1.0526 5.7886 9.2741 12.6402 1.0433 1.0368 1.0501 1.0408 1.0454 1.0565 1.0361 1.0777 1.0597 1.0984 1.0947 1.0897 1.0992 1.0990 1.1000 1.0996 1.0985 1.0985 1.0961 1.0976 1.1027 1.0999 1.1062
irintensity: 0.8206 1.4316 1.3535 0.2939 0.7094 0.0172 0.1418 0.2382 1.5988 2.0464 1.5514 1.5357 0.6593 1.7846 0.3268 1.1981 0.6142 0.8784 0.8711 0.9691 1.2030 0.0834 19.6524 0.2916 2.3732 1.5911 2.4256 1.8752 1.6204 1.6705 0.2270 0.4013 8.3509 7.4254 9.8124 4.5388 8.9246 3.9771 2.6920 0.5210 1.2942 32.4618 7.9567 5.4759 7.2495 25.4996 48.1554 34.2485 22.0244 5.3205 192.1981 15.1133 15.7291 14.4788 5.8827 4.4656 54.7820 10.7534 223.1206 63.6835 17.5631 0.0582 4.2185 6.2922 2.1523 0.3725 0.7321 0.2730 9.3812 5.0604 7.3823 23.4738 1.2835 15.3066 22.7855 17.7987 2.3471 14.6371 14.0914 10.4428 8.3702 3.3771 13.9486 13.4351 19.3362 1.8364 8.0719 13.6415 140.2970 162.3877 22.3061 40.1634 27.3615 34.8379 8.9772 23.3993 51.1073 22.1962 32.1965 30.3886 12.9519 9.6423 13.1433 37.9403 28.9175 38.4524 29.3747 0.9700 80.7003 33.8045 33.9908 1.9369 22.0648 28.4681
temp: 298.150 k
press: 1.00000 atm
elementType: 8 8 7 6 6 6 6 6 6 6 6 6 6 6 6 6 6 1 1 1 1 1 1 1 1 1 1 1 1 1 1 1 1 1 1 1 1 1 1 1
symmnumber: 1
zpe: 897561.7 jmol-1
zpe.correction: 0.341863 hartree
zpe.thermalcorrener: 0.362027 hartree
zpe.thermalcorrenthalpy: 0.362972 hartree
zpe.thermalcorrgfe: 0.293360 hartree
zpe.sumelectzpe: -751.119116 hartree
zpe.sumelectthermal: -751.098952 hartree
zpe.sumelectthermalent: -751.098008 hartree
zpe.sumelectthermalfe: -751.167619 hartree
dipole: -1.3367 2.8304 0.6013
dipole: 3.1874
quadrupole: -88.1416 -120.0782 -102.7683
quadrupole: 5.1234 -1.6007 0.8329
quadrupole: 15.5211 -16.4155 0.8944 5.1234 -1.6007 0.8329
hfenergy: -751.4609793 hartree
pointgroup: C01 [X(C14H23N1O2)]
dipole: -0.1883146 1.0235776 0.6995488 debye
polarizability: 190.0852595|-10.033598|177.6426432|-8.1524597|21.2290098|141.0429104 unknown
InChI: InChI=1S/C14H23NO2/c1-6-10(4)13(11(5)7-2)12(9-15)14(16)17-8-3/h10-11H,6-8H2,1-5H3
charge 0 multiplicity 1
40 atoms
O  2.576768 -0.826022 -1.064295
O  2.110905 1.319693 -0.296688
N  0.038561 -2.730306 -1.718377
C  -0.620255 1.626175 0.731552
C  -2.215339 -0.247785 -0.118617
C  -0.784556 0.313037 -0.038288
C  -1.228534 2.817305 -0.082854
C  -2.741071 -0.567337 -1.554385
C  -1.221526 1.524088 2.161454
C  -2.38619 -1.489234 0.809394
C  0.301529 -0.35274 -0.599152
C  -0.900912 4.195614 0.530496
C  -2.686528 0.612811 -2.54698
C  1.711763 0.167729 -0.608333
C  0.151739 -1.647567 -1.221682
C  4.025918 -0.470288 -1.161902
C  4.732903 -0.713765 0.174178
H  0.454318 1.845109 0.83257
H  -2.877658 0.545591 0.279363
H  -2.327091 2.697048 -0.168019
H  -0.82198 2.780582 -1.111598
H  -3.794506 -0.891325 -1.432465
H  -2.202055 -1.432523 -1.975874
H  -0.771758 0.685907 2.723637
H  -1.001269 2.450775 2.719162
H  -2.318555 1.389102 2.157594
H  -2.096414 -1.262164 1.85005
H  -3.445537 -1.805714 0.809117
H  -1.778529 -2.339959 0.456977
H  0.191233 4.324326 0.645364
H  -1.269397 5.005836 -0.125057
H  -1.3690 4.333915 1.521581
H  -3.127009 0.319471 -3.5171
H  -1.646639 0.934709 -2.738239
H  -3.250147 1.487612 -2.171979
H  4.397174 -1.138426 -1.954875
H  4.108684 0.584767 -1.477036
H  5.818683 -0.540533 0.055748
H  4.357187 -0.02572 0.949828
H  4.584086 -1.753495 0.512234
