program: Gaussian 09
title: 000278351
version: EM64L-G09RevD.01
frameworkgroup: C1[X(C12H17NO)]
method: RPBEPBE
basis: SDD
operation: Freq
keyword: #p
keyword: freq=noraman
keyword: PBEPBE/SDD
title: #p freq=noraman PBEPBE/SDD
converged: YES YES NO NO
title: Mulliken charges:
elementType: O N C C C C C C C C C C C C H H H H H H H H H H H H H H H H H
charge: -0.480447 -0.682713 -0.549099 0.261220 -0.352433 0.037569 0.222457 -0.823932 -0.682723 0.264194 -0.366809 -0.412567 -0.292552 -0.215397 0.221983 0.191887 0.211559 0.206280 0.262045 0.218536 0.223459 0.222767 0.213861 0.206010 0.243063 0.210288 0.223954 0.219521 0.353519 0.290217 0.354284
chargesum: 0.00000
title: Mulliken charges with hydrogens summed into heavy atoms:
elementType: O N C C C C C C C C C C C C
charge: -0.126929 -0.038212 -0.135230 0.261220 0.065406 0.037569 0.222457 -0.119892 -0.040085 0.264194 -0.123746 -0.202279 -0.068599 0.004125
polarizability: 2.06261322e+02 1.45875855e+00 1.48802854e+02 -5.87528718e+00 -6.77501383e+00 8.79217003e+01
1716.lowfreq: -14.5310 -4.4527 -0.0006 -0.0005 0.0001 6.5566 41.4992 49.1533 63.4541
frequency: 41.4678 49.1049 63.4054 87.7548 109.3535 168.1272 196.5019 217.2066 222.8390 244.0397 265.6996 299.5589 339.5028 343.2111 374.2159 388.3703 417.7094 438.8567 456.2467 520.8035 537.7011 569.6944 582.9192 598.9592 648.5163 677.6799 733.9499 750.2162 752.8315 814.4644 846.0580 851.0169 868.0852 908.3509 940.5873 965.3531 979.7323 1017.7734 1029.8206 1036.6445 1051.7215 1053.4113 1092.0233 1109.7266 1142.9362 1170.5232 1178.4584 1212.7847 1226.8264 1270.4342 1280.6856 1282.4840 1320.3742 1331.5731 1334.2183 1389.1231 1389.4283 1397.3389 1453.7195 1467.8457 1470.6194 1475.0694 1475.8679 1480.9122 1493.1043 1500.7485 1575.9099 1613.7149 1628.2178 1663.2541 2927.8719 2952.9388 2972.1982 2978.4988 3001.6730 3017.5808 3031.6342 3068.4917 3074.8908 3095.8036 3112.1251 3131.5752 3141.6007 3164.6422 3499.8661 3569.3575 3666.1130
redmass: 3.6250 3.6439 2.8361 1.9972 3.6508 3.1199 2.0031 2.1971 1.2024 1.8158 3.0765 2.8161 1.3502 3.2389 3.3781 2.5639 1.1900 3.1205 3.5254 3.1183 4.7205 3.5595 4.0946 1.2394 5.6034 5.0607 1.1077 1.9547 1.9483 3.8234 1.5170 1.7106 1.7014 2.3287 1.3566 1.3080 2.0961 1.8592 1.4711 1.8929 2.4897 1.8853 2.0959 2.0394 1.4259 1.1026 1.4864 1.7640 1.8699 1.4272 1.5659 1.2351 2.2283 1.6050 1.8183 1.9300 2.2710 1.2276 2.8392 1.0686 1.0671 1.0521 1.0427 1.0727 2.8152 1.0992 5.3549 2.1066 1.9888 6.7986 1.0669 1.0397 1.0359 1.0627 1.0900 1.0968 1.1011 1.1008 1.0992 1.0955 1.0866 1.0876 1.0938 1.1002 1.0475 1.0646 1.1009
irintensity: 0.1818 0.0171 0.3883 0.1734 3.2794 0.5514 1.0131 7.8472 0.9975 4.5729 2.9461 24.9237 26.6607 1.8130 10.1942 5.1351 124.4465 3.7604 4.1409 15.7185 4.3601 15.8193 6.4217 160.5027 18.0262 7.7899 5.0761 37.2073 62.1814 1.9041 1.4740 5.1542 7.7322 17.3937 5.1939 1.0873 55.9396 10.8167 1.2092 19.1265 3.7055 9.5322 10.9084 52.0734 10.6752 8.0082 56.3911 2.6941 7.3678 0.2140 2.1922 2.7039 28.6045 8.3389 17.0531 25.6999 0.5907 14.1919 36.3654 6.2259 5.8344 1.1681 16.5276 7.1116 57.5465 16.4710 8.9996 30.4530 241.7955 35.8941 46.1627 48.1903 49.4030 18.3819 22.4839 27.4955 16.4186 72.2424 43.3943 19.8033 14.7872 4.3029 37.5612 25.5694 89.0181 3.1687 50.0230
temp: 298.150 k
press: 1.00000 atm
elementType: 8 7 6 6 6 6 6 6 6 6 6 6 6 6 1 1 1 1 1 1 1 1 1 1 1 1 1 1 1 1 1
symmnumber: 1
zpe: 689612.7 jmol-1
zpe.correction: 0.262660 hartree
zpe.thermalcorrener: 0.277654 hartree
zpe.thermalcorrenthalpy: 0.278598 hartree
zpe.thermalcorrgfe: 0.220766 hartree
zpe.sumelectzpe: -596.381878 hartree
zpe.sumelectthermal: -596.366883 hartree
zpe.sumelectthermalent: -596.365939 hartree
zpe.sumelectthermalfe: -596.423771 hartree
dipole: -2.2123 0.8958 -0.4821
dipole: 2.4349
quadrupole: -76.4496 -75.3172 -90.0568
quadrupole: 1.8644 -3.5885 -2.2035
quadrupole: 4.1583 5.2906 -9.4489 1.8644 -3.5885 -2.2035
hfenergy: -596.6445372 hartree
pointgroup: C01 [X(C12H17N1O1)]
dipole: 0.8887186 -0.3576357 0.0009086 debye
polarizability: 205.7962019|7.1492836|140.328715|4.4700228|-22.5042911|96.86096 unknown
InChI: InChI=1S/C12H17NO/c1-3-6-9(2)12(14)10-7-4-5-8-11(10)13/h4-5,7-8,14H,3,6,13H2,1-2H3
charge 0 multiplicity 1
31 atoms
O  0.822377 -0.655742 1.579277
N  -1.129829 -2.39222 0.718485
C  2.862674 0.746957 0.076793
C  1.397043 0.722315 -0.353248
C  3.686256 -0.463988 -0.453658
C  0.446718 0.073055 0.396019
C  -1.016917 0.010394 0.158994
C  1.104724 1.377735 -1.690472
C  5.179158 -0.38124 -0.071031
C  -1.756755 -1.216599 0.311724
C  -1.720125 1.179744 -0.234556
C  -3.150006 -1.223781 0.003926
C  -3.099156 1.165109 -0.527209
C  -3.809732 -0.054693 -0.415791
H  3.329977 1.675483 -0.307504
H  2.977809 0.808857 1.18283
H  3.584655 -0.505543 -1.555575
H  3.248849 -1.408918 -0.073551
H  0.128401 1.07568 -2.101557
H  1.886386 1.097634 -2.424834
H  1.118091 2.484623 -1.621354
H  5.743962 -1.246341 -0.463472
H  5.641843 0.537063 -0.479143
H  5.312114 -0.361819 1.027629
H  -1.165636 2.122654 -0.293244
H  -3.709856 -2.162124 0.106959
H  -3.611187 2.085401 -0.82552
H  -4.88219 -0.090905 -0.640151
H  1.800181 -0.590716 1.716999
H  -1.683551 -3.235418 0.844147
H  -0.223578 -2.312454 1.181488
