program: Gaussian 09
title: 000278368
version: EM64L-G09RevD.01
frameworkgroup: C1[X(C13H23NO2)]
method: RPBEPBE
basis: SDD
operation: Freq
keyword: #p
keyword: freq=noraman
keyword: PBEPBE/SDD
title: #p freq=noraman PBEPBE/SDD
converged: NO YES NO NO
title: Mulliken charges:
elementType: O O N C C C C C C C C C C C C C H H H H H H H H H H H H H H H H H H H H H H H
charge: -0.278379 -0.206081 -0.008456 0.245148 -0.079358 -0.081598 -0.401328 -0.399685 -0.774420 -0.762220 0.150864 -0.260163 -0.719893 -0.716533 -0.260959 -0.665016 0.244723 0.219846 0.234254 0.208523 0.249405 0.204244 0.240333 0.234654 0.224881 0.219173 0.224893 0.245706 0.221266 0.224727 0.208391 0.208930 0.224568 0.216749 0.224653 0.240111 0.223118 0.251386 0.223542
chargesum: 0.00000
title: Mulliken charges with hydrogens summed into heavy atoms:
elementType: O O N C C C C C C C C C C C C C
charge: -0.278379 -0.206081 -0.008456 0.245148 0.165365 0.138248 0.041449 0.053964 -0.074552 -0.072448 0.150864 -0.260163 -0.065509 -0.066286 0.203804 0.033030
polarizability: 1.58413100e+02 1.55795184e+00 1.45732847e+02 3.81424881e+00 4.96296933e+00 1.43738337e+02
1716.lowfreq: -15.0352 -5.7000 -4.0602 -0.0007 -0.0006 -0.0005 36.5409 50.1026 65.3860
frequency: 36.3652 50.0175 65.2915 71.4743 78.3167 81.4701 96.3927 111.3004 131.1039 147.2250 158.1166 175.8656 194.2379 200.4870 204.5540 221.4819 240.2880 262.6552 291.4453 301.4877 313.6050 326.9620 358.5444 369.3878 415.0558 417.1366 445.5819 470.4363 482.0784 576.5103 657.7961 698.2158 728.7963 770.5912 780.9731 805.3460 815.9265 832.1947 851.5512 921.5718 954.5003 956.8766 972.3756 977.4486 996.4328 1001.0499 1012.5341 1043.2647 1051.6292 1089.0984 1097.0545 1107.7458 1123.9706 1152.7584 1155.8942 1166.3666 1171.4174 1186.5072 1261.2996 1270.5470 1278.8770 1288.7922 1308.8139 1326.5496 1333.2721 1345.4298 1352.0871 1356.2900 1388.0595 1391.9357 1392.8493 1396.4679 1399.2773 1457.5234 1461.2206 1462.1393 1465.3260 1473.5699 1475.2970 1476.3094 1480.5531 1482.4141 1484.2662 1485.7064 1491.3434 1497.3107 1626.2170 2190.7165 2972.4258 2978.4969 2978.6744 2980.8559 2985.5474 2988.4417 2993.6388 2995.7988 3016.4585 3031.7959 3032.1674 3037.2608 3070.4393 3074.1594 3076.8315 3077.0432 3082.5313 3083.5585 3087.9563 3090.0980 3094.6480 3099.9208 3120.6156
redmass: 3.4113 3.0491 2.2048 1.9734 3.3406 4.6855 2.7401 2.8407 5.0664 2.5393 3.0459 2.4599 1.0727 1.5048 1.0395 1.5309 1.9052 1.8576 2.5275 2.8194 2.9060 2.4436 4.6541 3.4100 4.0373 3.0515 2.7341 4.4681 4.1372 4.6600 3.3092 5.1498 3.0112 1.2860 1.2653 2.4076 1.6398 2.1616 2.0332 2.5847 2.2038 1.8418 1.2452 1.4174 1.8460 2.0630 2.6329 2.7780 2.9688 2.6608 2.2392 2.4073 2.5072 2.4906 1.7059 2.0340 2.4948 2.4944 1.3010 1.2741 1.1170 1.1850 1.2730 1.2999 1.3847 1.3695 1.3408 1.3260 1.2151 1.2173 1.2290 1.1968 1.1960 1.0923 1.0555 1.0558 1.0638 1.0528 1.0484 1.0431 1.0546 1.0497 1.0596 1.0653 1.0484 1.0460 9.9867 12.6595 1.0649 1.0369 1.0364 1.0602 1.0382 1.0783 1.0361 1.0361 1.0840 1.0944 1.0646 1.0984 1.0991 1.1005 1.0993 1.0989 1.0993 1.0988 1.0977 1.0980 1.1027 1.0993 1.1065
irintensity: 0.2279 0.7606 0.3619 0.2197 0.4332 0.6193 0.3075 0.5333 1.8067 2.2997 1.1465 2.8114 0.3915 0.6513 0.0321 0.2653 0.0651 0.1117 0.2424 3.5573 2.5457 3.2631 2.7211 5.5880 5.1467 0.7535 1.2466 1.7140 0.1169 4.5323 1.9992 3.6226 8.0517 7.6373 4.5675 3.6946 5.5324 0.2968 0.3896 6.2647 0.7570 14.4925 2.2809 16.5477 3.1111 7.3646 56.5026 2.5194 2.6021 182.8928 31.0419 56.8718 26.7302 43.4447 4.6016 2.7131 6.1758 38.4697 3.4528 0.8443 3.4960 3.5920 6.3001 0.4617 1.9044 2.3665 1.7981 0.5207 12.6423 13.0243 21.6232 23.6986 20.0775 14.4626 8.9938 4.7236 0.1536 5.9689 14.4866 7.4640 1.4164 13.8356 21.0034 12.1441 11.1615 5.1899 139.6545 5.0099 14.0643 45.5815 24.4572 15.6423 14.9428 32.5806 14.5665 24.8513 4.0222 15.7757 18.3381 16.3238 32.8028 40.4809 59.4415 35.1072 58.4937 14.7827 37.3747 35.9833 3.0719 21.7129 26.9836
temp: 298.150 k
press: 1.00000 atm
elementType: 8 8 7 6 6 6 6 6 6 6 6 6 6 6 6 6 1 1 1 1 1 1 1 1 1 1 1 1 1 1 1 1 1 1 1 1 1 1 1
symmnumber: 1
zpe: 881794.9 jmol-1
zpe.correction: 0.335858 hartree
zpe.thermalcorrener: 0.356170 hartree
zpe.thermalcorrenthalpy: 0.357115 hartree
zpe.thermalcorrgfe: 0.287354 hartree
zpe.sumelectzpe: -713.080463 hartree
zpe.sumelectthermal: -713.060151 hartree
zpe.sumelectthermalent: -713.059207 hartree
zpe.sumelectthermalfe: -713.128968 hartree
dipole: -1.4216 -1.6029 -5.3033
dipole: 5.7197
quadrupole: -92.7155 -93.4601 -115.1652
quadrupole: 1.2744 -1.1759 -3.0787
quadrupole: 7.7315 6.9868 -14.7183 1.2744 -1.1759 -3.0787
hfenergy: -713.4163212 hartree
pointgroup: C01 [X(C13H23N1O2)]
dipole: 0.844662 0.9538177 -1.8548921 debye
polarizability: 159.3435856|0.9405984|147.2080818|-2.6684961|-3.5481459|141.3326166 unknown
InChI: InChI=1S/C13H23NO2/c1-6-10(4)13(9-14,11(5)7-2)12(15)16-8-3/h10-11H,6-8H2,1-5H3
charge 0 multiplicity 1
39 atoms
O  1.502757 1.362738 -0.197194
O  1.474544 0.190616 1.813079
N  -1.693266 -1.309593 2.191637
C  -0.403108 -0.08932 0.190903
C  -1.336331 1.082138 -0.334265
C  -0.096518 -1.215908 -0.907281
C  -2.687426 0.541772 -0.877474
C  0.940183 -2.245612 -0.37249
C  -1.552089 2.145781 0.769005
C  0.321535 -0.637644 -2.277833
C  0.937104 0.480317 0.723263
C  -1.084048 -0.761102 1.325823
C  -3.566285 1.62912 -1.535676
C  0.924666 -3.583586 -1.142717
C  2.827766 1.956316 0.181695
C  3.975888 1.025651 -0.216089
H  -0.781488 1.556444 -1.165789
H  -1.054429 -1.759471 -1.037157
H  -3.249102 0.064714 -0.049602
H  -2.497789 -0.25123 -1.625543
H  0.737487 -2.451072 0.696043
H  1.955854 -1.802578 -0.417667
H  -2.12455 1.73059 1.618865
H  -0.592595 2.531334 1.15797
H  -2.111328 3.008561 0.369002
H  0.542284 -1.465003 -2.975283
H  -0.476255 -0.027951 -2.736293
H  1.222474 -0.007711 -2.188668
H  -4.461681 1.175444 -1.998181
H  -3.916957 2.376342 -0.80254
H  -3.013227 2.166339 -2.329996
H  1.176789 -3.455361 -2.211273
H  1.658115 -4.28878 -0.71175
H  -0.07196 -4.060165 -1.083723
H  2.848677 2.906867 -0.374632
H  2.823925 2.147503 1.268939
H  4.942008 1.51484 0.007634
H  3.930911 0.082041 0.352894
H  3.948261 0.798516 -1.295938
