program: Gaussian 09
title: 000278345
version: EM64L-G09RevD.01
frameworkgroup: C1[X(C10H13NO)]
method: RPBEPBE
basis: SDD
operation: Freq
keyword: #p
keyword: freq=noraman
keyword: PBEPBE/SDD
title: #p freq=noraman PBEPBE/SDD
converged: NO YES NO NO
title: Mulliken charges:
elementType: O N C C C C C C C C C C H H H H H H H H H H H H H
charge: -0.482839 -0.695535 0.133135 0.029406 0.263962 0.287234 -0.353246 -0.415963 -0.789234 -0.788942 -0.284257 -0.210903 0.243192 0.214085 0.266665 0.210577 0.219646 0.218357 0.257055 0.217135 0.225918 0.221379 0.352681 0.298113 0.362378
chargesum: 0.00000
title: Mulliken charges with hydrogens summed into heavy atoms:
elementType: O N C C C C C C C C C C
charge: -0.120461 -0.044741 0.133135 0.029406 0.263962 0.287234 -0.110053 -0.201878 -0.092345 -0.096395 -0.058339 0.010477
polarizability: 1.68048342e+02 -9.29860505e-01 1.26154084e+02 2.05196428e+00 8.07600377e+00 7.61597691e+01
1716.lowfreq: -14.7474 -11.0870 -3.0617 -0.0004 0.0004 0.0005 59.4906 88.1967 107.7471
frequency: 59.4351 88.1898 107.7459 139.4759 173.4530 200.4168 226.1512 277.7458 307.7743 325.0711 337.5573 359.5343 387.6331 398.0578 436.3896 499.8737 530.2962 546.0012 579.3220 604.6857 623.2314 670.7045 739.4942 751.8897 813.8310 847.2680 882.1681 938.1025 957.3004 967.2314 974.8071 988.5529 1025.3118 1046.9842 1073.4701 1079.8184 1134.2608 1171.4276 1215.4988 1228.6398 1270.9788 1291.2441 1322.3623 1382.5640 1383.7563 1396.0051 1450.8559 1457.2759 1465.0832 1469.5180 1479.3067 1490.1141 1573.7898 1614.1798 1629.6614 1701.8457 2957.9252 2962.7252 3025.0600 3028.7643 3099.3792 3110.7986 3114.9426 3130.5629 3140.7388 3165.1844 3520.4032 3547.4648 3681.2389
redmass: 3.9435 3.4125 3.1816 1.0323 1.8869 1.9450 3.0067 3.7370 3.1135 1.2134 3.1678 3.1736 2.1381 1.1935 3.0381 3.2320 5.7797 3.2289 3.5967 1.3376 4.4646 5.5490 3.9300 1.3026 4.8317 1.4537 3.5420 1.3662 1.3713 1.3042 1.2510 3.7216 1.7379 1.8472 1.8877 1.6581 1.3655 1.0550 1.5237 3.8902 1.9443 2.7036 1.8301 1.2552 7.8061 1.2246 2.8055 1.0501 1.0580 1.0761 1.0478 2.8595 5.9194 2.7491 1.5805 6.6110 1.0389 1.0390 1.0970 1.0963 1.0961 1.0962 1.0865 1.0876 1.0943 1.1001 1.0471 1.0657 1.1023
irintensity: 0.7829 0.8448 0.5964 0.5975 1.1614 1.8079 7.0040 8.1136 12.3030 228.1035 12.7736 9.3488 33.3830 42.5456 2.7759 10.4464 3.7324 2.0595 4.6809 84.5897 12.4915 4.2103 0.8560 92.7522 5.6303 1.3290 4.6482 2.9699 9.7484 0.0322 0.2621 29.4600 7.7378 13.4869 120.6330 23.3569 11.9411 7.9912 42.6751 18.6667 12.3379 23.2684 30.2820 15.7215 17.5110 7.9665 32.7087 11.5873 5.3049 2.0491 20.5733 67.5710 12.4285 5.7165 246.3535 5.6688 20.9660 93.8962 14.9623 40.6083 22.2889 10.2808 13.8334 0.8136 36.4284 24.5667 74.8907 14.8626 39.7125
temp: 298.150 k
press: 1.00000 atm
elementType: 8 7 6 6 6 6 6 6 6 6 6 6 1 1 1 1 1 1 1 1 1 1 1 1 1
symmnumber: 1
zpe: 541779.9 jmol-1
zpe.correction: 0.206353 hartree
zpe.thermalcorrener: 0.218822 hartree
zpe.thermalcorrenthalpy: 0.219767 hartree
zpe.thermalcorrgfe: 0.168542 hartree
zpe.sumelectzpe: -517.938292 hartree
zpe.sumelectthermal: -517.925823 hartree
zpe.sumelectthermalent: -517.924878 hartree
zpe.sumelectthermalfe: -517.976103 hartree
dipole: -0.7353 0.9566 0.1124
dipole: 1.2118
quadrupole: -68.5878 -63.9265 -72.3366
quadrupole: -5.0219 -0.4512 2.5579
quadrupole: -0.3042 4.3571 -4.0529 -5.0219 -0.4512 2.5579
hfenergy: -518.144645 hartree
pointgroup: C01 [X(C10H13N1O1)]
dipole: -0.2616902 -0.3712272 0.1448977 debye
dipolederiv: -0.5326801 -0.0529409 -0.2188102 -0.2378708 -0.5330326 0.4337258 -0.1174954 0.3039028 -0.8094424 -0.2944482 0.4755383 0.0105779 0.3205958 -1.2368128 0.1259246 0.0290205 0.0699654 -0.6646896 0.0208898 -0.1317068 -0.0541159 0.2231149 -0.3015057 0.1612643 -0.0959886 0.0370629 -0.1816188 0.379662 0.0740103 0.0584709 0.0787991 0.1321813 -0.4325296 0.0142099 -0.3595732 0.6382781 0.1602881 -0.0567197 0.0679883 0.0932779 -0.1127577 -0.0880689 -0.070756 -0.072938 0.0145416 0.0240217 -0.5648266 0.0810337 -0.3125409 1.224025 -0.1955111 0.0200558 -0.1803945 0.1258331 0.2280728 0.0225335 0.0500966 -0.2302925 0.1025359 -0.0445423 0.0982578 -0.0331686 -0.1164504 -0.0280198 0.4847898 -0.0352204 -0.0251069 -0.1801756 0.0007599 0.0599217 0.0760417 -0.2369731 -0.1073546 0.0483715 -0.0866092 -0.0575317 0.084634 0.0554779 0.0343129 0.0700392 -0.040342 -0.0776622 0.0012038 -0.0184125 0.0615843 0.1008941 0.0605172 -0.0789732 0.0813559 -0.0276692 -0.3894987 -0.1068063 0.0067097 -0.133719 -0.1179712 -0.0216548 -0.02496 -0.0282905 -0.2147926 0.0992247 -0.0338449 0.047394 0.2383125 0.2823295 -0.0314946 -0.0007593 -0.0547119 -0.1211407 0.0195059 -0.1149556 -0.0093874 -0.0926376 -0.0222778 0.0120856 -0.0080325 0.0142123 0.1260703 -0.0045284 -0.0813618 -0.0042826 -0.1297176 -0.0945256 0.0188966 -0.0135491 0.0227587 0.1624528 0.1098239 0.0049484 -0.0168083 0.0341584 0.0883544 0.0613764 -0.0944231 0.0460025 -0.0658731 -0.075243 -0.0866172 0.0200285 -0.1620376 -0.1029316 0.0259694 -0.0061058 0.0361729 0.1107017 -0.0436554 0.0408541 0.0601378 0.1273853 0.0029523 -0.1055834 0.0898963 -0.114267 -0.0039526 -0.0099368 0.0490535 0.1329127 0.0814094 0.0413813 -0.0889991 0.1474241 -0.0180992 -0.0811694 -0.0760796 0.013351 -0.1128522 0.006098 0.0758136 0.007736 -0.0858779 -0.0081604 0.0793391 0.0838969 -0.0667877 -0.0023106 -0.1207542 -0.1496446 0.061745 0.0165318 -0.0091773 0.0432714 0.0304557 0.065863 -0.0199594 0.0913867 -0.0918218 0.0354851 -0.0348221 0.0358523 0.1687354 -0.1465758 0.022231 -0.0362096 0.0195922 0.0929622 0.0090637 -0.0383191 0.010254 0.1465987 0.2615319 -0.0301542 -0.0159717 0.0525309 0.2433101 -0.0034559 0.0095656 0.075344 0.3287306 0.1118412 -0.0386331 -0.0403791 -0.0298257 0.2058001 0.0078315 -0.033043 0.0123157 0.3545863 0.2564682 0.0626067 0.1359789 0.1037892 0.2662835 -0.0660194 0.1839087 -0.0124998 0.2649748 unknown
polarizability: 167.6808258|2.1391237|122.2033466|-4.4272894|-16.1310219|80.4780228 unknown
InChI: InChI=1S/C10H13NO/c1-7(2)10(12)8-5-3-4-6-9(8)11/h3-6,12H,11H2,1-2H3
charge 0 multiplicity 1
25 atoms
O  1.54939 -0.904079 1.48023
N  -0.611795 -2.400139 0.35973
C  -0.284134 0.030901 0.119808
C  1.183015 -0.114384 0.32127
C  2.197912 0.331345 -0.478367
C  -1.142119 -1.127417 0.157104
C  -0.867939 1.305764 -0.096582
C  -2.542967 -0.954434 -0.045594
C  3.651894 0.137831 -0.092431
C  1.953536 0.997044 -1.81971
C  -2.254708 1.467752 -0.297071
C  -3.088545 0.323241 -0.272309
H  -0.208651 2.181524 -0.096671
H  -3.197503 -1.835024 -0.026545
H  3.751376 -0.219203 0.943893
H  4.211207 1.087606 -0.20544
H  4.141603 -0.60046 -0.759084
H  2.560954 0.501722 -2.603295
H  0.896834 0.957913 -2.127999
H  2.269548 2.059531 -1.800618
H  -2.678532 2.463335 -0.461516
H  -4.169346 0.427138 -0.423036
H  0.37324 -2.50723 0.600058
H  -1.214336 -3.217395 0.335681
H  0.894369 -0.72868 2.203394
