program: Gaussian 09
title: 000278403
version: EM64L-G09RevD.01
frameworkgroup: C1[X(C11H15N5O3)]
method: RPBEPBE
basis: SDD
operation: Freq
keyword: #p
keyword: freq=noraman
keyword: PBEPBE/SDD
title: #p freq=noraman PBEPBE/SDD
converged: YES YES NO NO
title: Mulliken charges:
elementType: O O O N N N N N C C C C C C C C C C C H H H H H H H H H H H H H H H
charge: -0.320103 -0.435822 -0.436560 -0.190817 -0.084709 -0.170601 -0.062005 -0.605075 -0.124793 -0.142422 -0.081622 -0.057931 -0.736873 -0.339308 0.230936 -0.200980 -0.102698 0.171900 -0.335901 0.248351 0.210738 0.239105 0.259206 0.208075 0.257224 0.217929 0.197210 0.221096 0.387974 0.288701 0.351493 0.251673 0.337453 0.349156
chargesum: 0.00000
title: Mulliken charges with hydrogens summed into heavy atoms:
elementType: O O O N N N N N C C C C C C C C C C C
charge: -0.320103 -0.047847 -0.085068 -0.190817 -0.084709 -0.170601 -0.062005 0.081534 0.123558 0.068316 0.157483 0.201275 -0.053645 0.078997 0.230936 0.087721 -0.102698 0.171900 -0.084228
polarizability: 2.25921786e+02 -8.75528967e-01 1.65904532e+02 6.59980522e+00 -7.35478752e+00 9.53609387e+01
1716.lowfreq: -12.3824 -10.4532 -5.5213 0.0006 0.0008 0.0008 30.6258 42.3483 62.6052
frequency: 30.5914 42.3246 62.5872 78.0250 94.1420 120.4909 158.8768 173.3583 199.7688 214.6587 233.4125 237.6433 258.8673 284.5498 305.2323 321.0701 352.7730 414.2128 444.3313 468.3719 517.9540 520.3619 534.9781 550.8351 554.6348 555.5151 563.0259 610.6241 621.8953 642.8259 664.1597 709.3755 774.8699 791.8832 806.0581 840.2070 848.6014 866.8541 902.4963 921.4122 929.9769 959.9001 961.8258 986.9091 996.4881 1014.1649 1045.1523 1055.3371 1099.7356 1109.5890 1125.1412 1138.7839 1156.1285 1177.3506 1180.5406 1202.9787 1220.4242 1247.8668 1268.0111 1277.3518 1288.8179 1295.2680 1312.7806 1324.4157 1335.6435 1342.0103 1347.4819 1358.2728 1372.5076 1379.6524 1385.7453 1391.5841 1432.1337 1454.3959 1467.1214 1472.3552 1474.7169 1481.6926 1538.2523 1580.8610 1636.2536 2924.6221 2961.2237 2981.2801 2986.0076 2992.1504 3007.1345 3011.9285 3073.8455 3075.9943 3094.3742 3171.8793 3262.2610 3536.8991 3551.5369 3691.2177
redmass: 6.5142 4.3926 5.4950 4.8784 5.6015 3.8269 3.5518 5.7654 2.7838 1.5126 2.5240 4.2015 4.5039 4.5064 5.2416 4.1249 5.2593 2.9486 1.2535 3.2699 6.7911 3.8019 1.2766 3.6776 1.3015 2.3270 3.8750 6.4039 6.4078 4.6549 9.4054 7.0739 3.8706 6.6470 3.9896 1.4582 1.1757 6.4637 1.8115 1.8281 1.4279 2.9025 2.5393 5.3032 2.8378 4.2932 4.1907 3.6428 2.4651 2.7601 2.6227 2.5177 2.7462 1.4282 1.4658 1.3673 2.6282 1.4668 1.8266 1.5203 2.3180 1.8157 1.4858 2.5604 1.5183 1.3836 1.4007 1.3329 1.9407 6.5358 1.3651 1.2187 3.0241 1.0866 1.3510 3.5788 1.0658 1.0612 8.4709 1.8263 2.8241 1.0827 1.0680 1.0372 1.0836 1.0852 1.0838 1.0697 1.0990 1.0967 1.0993 1.0925 1.0988 1.0444 1.0656 1.1056
irintensity: 0.1640 1.4589 1.5727 5.7561 0.3635 5.1817 5.3768 3.2123 0.7831 2.7583 2.6226 2.6174 5.3776 2.9396 3.3372 9.4151 8.2658 17.9719 170.8586 9.3834 2.1379 12.5124 241.3910 12.3067 1.4487 7.3794 9.9500 2.8751 7.8027 44.1040 14.8772 22.4087 6.1927 4.8592 39.2237 41.2517 100.3017 11.6617 1.4128 3.4606 7.7690 123.1885 51.0578 142.2271 14.5083 20.2060 18.4929 6.4858 34.6606 31.9487 9.9053 13.1985 21.9261 22.1067 61.0110 3.8462 36.2689 6.2406 58.8053 72.5303 37.2844 27.6975 6.7024 12.5899 24.0801 31.4354 28.1742 25.9477 34.3178 12.8684 32.6429 13.8710 44.8339 1.8623 137.9074 17.0028 11.4466 40.3334 45.9862 30.5669 640.1959 29.7933 38.9697 35.8517 4.6946 18.0212 124.0966 783.1435 36.3504 32.7101 15.1771 10.8312 3.0023 141.6461 7.7720 53.4764
temp: 298.150 k
press: 1.00000 atm
elementType: 8 8 8 7 7 7 7 7 6 6 6 6 6 6 6 6 6 6 6 1 1 1 1 1 1 1 1 1 1 1 1 1 1 1
symmnumber: 1
zpe: 702458.1 jmol-1
zpe.correction: 0.267552 hartree
zpe.thermalcorrener: 0.284644 hartree
zpe.thermalcorrenthalpy: 0.285588 hartree
zpe.thermalcorrgfe: 0.222215 hartree
zpe.sumelectzpe: -926.178587 hartree
zpe.sumelectthermal: -926.161494 hartree
zpe.sumelectthermalent: -926.160550 hartree
zpe.sumelectthermalfe: -926.223923 hartree
dipole: 1.7548 -0.4438 0.5280
dipole: 1.8855
quadrupole: -104.4494 -121.0427 -111.2381
quadrupole: -14.4697 3.3069 3.5770
quadrupole: 7.7940 -8.7993 1.0053 -14.4697 3.3069 3.5770
hfenergy: -926.4461388 hartree
pointgroup: C01 [X(C11H15N5O3)]
dipole: 0.6893599 0.120385 -0.2461237 debye
polarizability: 225.0203305|-3.5028601|164.6769118|-12.2529479|-11.6996288|97.4900142 unknown
InChI: InChI=1S/C11H15N5O3/c1-5-6(2-17)19-11(8(5)18)16-4-15-7-9(12)13-3-14-10(7)16/h3-6,8,11,17-18H,2,12H2,1H3
charge 0 multiplicity 1
34 atoms
O  -2.115141 1.20071 0.312553
O  -1.117463 -2.299912 0.785733
O  -4.608189 2.557974 -0.022416
N  0.212352 0.654863 0.189551
N  1.924086 2.020084 -0.502579
N  1.474087 -1.486899 0.40429
N  3.842999 -1.220984 -0.17107
N  4.776432 0.838149 -0.853588
C  -3.092093 -1.015981 0.039429
C  -1.554529 -1.145716 0.042843
C  -3.300444 0.475328 -0.301676
C  -1.112147 0.207559 0.679657
C  -3.781641 -1.996918 -0.922375
C  -4.55161 1.12801 0.286737
C  1.352167 -0.149606 0.127205
C  0.614413 1.946181 -0.192345
C  2.397797 0.710785 -0.300532
C  3.687699 0.120347 -0.448063
C  2.754798 -1.937333 0.229961
H  -3.434913 -1.207683 1.076784
H  -1.184222 -1.163601 -1.008623
H  -3.255701 0.657073 -1.393932
H  -1.06673 0.104792 1.782765
H  -3.481544 -1.804797 -1.969954
H  -3.492212 -3.030368 -0.666103
H  -4.882487 -1.923202 -0.862361
H  -4.574981 0.951437 1.383337
H  -5.458026 0.693954 -0.168871
H  -0.097066 -2.289237 0.73921
H  -0.095429 2.76663 -0.2372
H  -3.768183 2.965374 0.312816
H  2.927414 -2.997381 0.435215
H  5.67507 0.367562 -0.941137
H  4.680238 1.829707 -1.063861
