program: Gaussian 09
title: 000278361
version: EM64L-G09RevD.01
frameworkgroup: C1[X(C12H19NO2)]
method: RPBEPBE
basis: SDD
operation: Freq
keyword: #p
keyword: freq=noraman
keyword: PBEPBE/SDD
title: #p freq=noraman PBEPBE/SDD
converged: YES YES NO NO
title: Mulliken charges:
elementType: O O N C C C C C C C C C C C C H H H H H H H H H H H H H H H H H H H
charge: -0.264046 -0.225295 -0.003689 0.058083 0.338134 -0.438724 -0.247615 -0.750032 -0.384543 0.239820 -0.854141 -0.206306 -0.689041 -0.261149 -0.662283 0.211910 0.216892 0.220026 0.237737 0.235125 0.246964 0.206713 0.201839 0.270912 0.244042 0.252633 0.219535 0.210918 0.208689 0.225491 0.237529 0.220981 0.254829 0.228061
chargesum: 0.00000
title: Mulliken charges with hydrogens summed into heavy atoms:
elementType: O O N C C C C C C C C C C C C
charge: -0.264046 -0.225295 -0.003689 0.058083 0.338134 -0.009922 -0.027589 -0.030206 0.024009 0.239820 -0.086553 -0.206306 -0.049900 0.201871 0.041589
polarizability: 1.64176461e+02 9.09641155e+00 1.44126477e+02 -2.84897528e+00 -7.03527092e+00 1.17107202e+02
1716.lowfreq: -12.2741 -10.0875 0.0005 0.0007 0.0010 4.2305 6.1324 30.2248 38.3307
frequency: -11.4162 30.1353 38.2349 60.6530 71.6249 86.1667 94.5846 126.3369 133.8202 146.8844 166.2483 206.0398 230.3731 235.3260 244.7353 255.4479 282.8329 299.0909 320.4352 347.0419 369.2430 403.8774 436.9743 458.4005 475.5126 495.9305 584.5499 641.3548 704.6785 721.1146 730.3976 786.7814 817.0171 818.5395 847.2341 884.7511 898.7286 910.4592 970.5190 1007.1658 1045.6530 1047.5072 1071.9390 1084.8205 1090.2867 1094.5269 1097.7906 1108.7442 1152.3186 1157.3232 1172.9054 1198.8876 1227.1006 1269.5212 1278.0992 1288.6747 1340.4475 1353.8968 1355.3336 1391.5656 1392.8290 1393.8387 1407.2580 1451.5022 1457.1044 1463.8722 1466.9237 1468.6469 1472.7530 1478.8751 1479.6030 1484.9370 1485.2439 1486.7486 1620.8931 1670.8488 2194.7130 2948.6138 2971.2657 2973.9363 2978.5151 2993.2949 2995.2062 3012.1239 3027.0389 3032.5062 3053.7468 3069.7502 3075.0303 3090.0349 3096.9813 3099.4413 3108.1207 3114.5497 3122.6835 3131.7510
redmass: 2.1884 3.3914 4.0176 2.7015 2.4902 4.2309 3.9311 3.9957 4.3487 1.1112 3.5546 1.7110 1.8780 1.1118 1.9587 2.9609 1.3317 2.5251 2.9307 3.1492 4.1725 4.5450 5.2744 4.1864 3.6396 3.1925 5.4942 3.9647 5.1832 1.3591 2.3351 2.0876 1.4451 1.5703 2.9536 1.4840 1.7738 1.7979 2.2785 2.5131 3.0761 1.4545 2.2805 2.0517 1.7009 2.1923 2.2709 3.0616 2.3268 1.8664 3.0803 3.7254 1.3326 1.3501 1.1191 1.0875 1.3977 1.2717 1.5682 1.2095 1.2036 1.2088 1.2278 1.0716 1.0983 1.0436 1.0488 1.0552 1.0614 1.0590 1.0431 1.0712 1.0520 1.0500 9.8912 7.4018 12.6590 1.0614 1.0588 1.0369 1.0386 1.0961 1.0363 1.0353 1.1024 1.0595 1.0960 1.1007 1.0993 1.0974 1.1033 1.0978 1.1005 1.0900 1.1063 1.0998
irintensity: 0.4376 0.9909 0.3938 0.1062 0.1012 1.2294 1.1718 1.0996 1.5643 0.2152 3.2170 4.2803 0.3793 0.0502 1.0119 1.6579 1.6753 1.1062 12.2583 1.6024 0.8681 3.1932 3.0175 0.6583 4.7949 4.4175 2.9370 10.4292 3.3881 12.0072 4.9923 3.8054 3.1161 3.7330 0.7216 8.3217 10.1196 2.9528 1.2723 31.3664 18.6865 11.7952 190.2659 4.9223 37.9632 80.4115 23.3563 18.8160 88.5271 6.6412 2.3912 65.4185 0.1769 0.1272 4.6637 0.4307 4.1480 0.7760 4.2622 13.0088 31.6948 11.1660 36.5161 4.4179 12.9829 16.1689 14.3578 8.7769 4.4291 11.3019 16.6273 7.5389 12.7018 20.7109 148.6240 2.0975 6.4993 12.8400 45.0735 32.0421 11.9796 6.7490 17.3432 11.7033 26.0020 25.9470 6.5470 72.1528 48.7921 31.1971 0.9002 14.5150 25.8474 11.4616 26.8743 10.7942
temp: 298.150 k
press: 1.00000 atm
elementType: 8 8 7 6 6 6 6 6 6 6 6 6 6 6 6 1 1 1 1 1 1 1 1 1 1 1 1 1 1 1 1 1 1 1
symmnumber: 1
zpe: 747293.8 jmol-1
zpe.correction: 0.284629 hartree
zpe.thermalcorrener: 0.302374 hartree
zpe.thermalcorrenthalpy: 0.303318 hartree
zpe.thermalcorrgfe: 0.238264 hartree
zpe.sumelectzpe: -672.664360 hartree
zpe.sumelectthermal: -672.646615 hartree
zpe.sumelectthermalent: -672.645671 hartree
zpe.sumelectthermalfe: -672.710725 hartree
dipole: -1.9393 -5.2762 0.9870
dipole: 5.7073
quadrupole: -87.0367 -101.5355 -90.8113
quadrupole: -13.8808 3.4331 0.6861
quadrupole: 6.0911 -8.4077 2.3165 -13.8808 3.4331 0.6861
hfenergy: -672.9489887 hartree
pointgroup: C01 [X(C12H19N1O2)]
dipole: -1.5700902 -1.590239 0.2186986 debye
polarizability: 168.1909382|-0.8646032|140.8675216|-0.8320178|-4.9354791|116.3516807 unknown
InChI: InChI=1S/C12H19NO2/c1-5-7-8-10(3)12(4,9-13)11(14)15-6-2/h8H,5-7H2,1-4H3
charge 0 multiplicity 1
34 atoms
O  0.860139 -2.129623 0.447916
O  2.113812 -0.879643 -1.066691
N  2.574269 2.252727 0.708821
C  0.754667 0.289635 0.669385
C  -0.471089 0.745234 -0.193051
C  -3.00827 0.827747 -0.555381
C  -1.742125 0.467062 0.206888
C  0.416904 -0.034179 2.151395
C  -4.296751 0.512646 0.240747
C  1.350953 -0.94343 -0.077636
C  -0.135157 1.465889 -1.485264
C  1.778026 1.366573 0.664216
C  -5.579349 0.859732 -0.542711
C  1.292274 -3.391999 -0.240081
C  2.635293 -3.874309 0.312003
H  -3.03901 0.278551 -1.521134
H  -3.001443 1.903994 -0.824006
H  -1.90293 -0.065694 1.153516
H  1.336714 -0.284642 2.705613
H  -0.055407 0.842341 2.625249
H  -0.25978 -0.898719 2.214108
H  -4.279839 1.074192 1.196374
H  -4.304194 -0.563387 0.508656
H  0.680169 0.953101 -2.028367
H  -1.010537 1.531452 -2.150992
H  0.219905 2.494975 -1.283637
H  -6.486562 0.628156 0.04436
H  -5.608898 1.935468 -0.79975
H  -5.633349 0.287868 -1.488409
H  0.472408 -4.093491 -0.018917
H  1.348161 -3.194265 -1.324763
H  2.893803 -4.847757 -0.14441
H  3.439044 -3.158717 0.071873
H  2.587849 -4.009187 1.406281
