program: Gaussian 09
title: 000278346
version: EM64L-G09RevD.01
frameworkgroup: C1[X(C13H17NO)]
method: RPBEPBE
basis: SDD
operation: Freq
keyword: #p
keyword: freq=noraman
keyword: PBEPBE/SDD
title: #p freq=noraman PBEPBE/SDD
converged: YES YES NO NO
title: Mulliken charges:
elementType: O N C C C C C C C C C C C C C H H H H H H H H H H H H H H H H H
charge: -0.474293 -0.680527 -0.392081 -0.377501 -0.402600 -0.549610 -0.552742 0.326753 -0.020754 0.226578 0.265172 -0.367082 -0.413490 -0.297009 -0.215448 0.210112 0.187338 0.204290 0.201128 0.203405 0.207075 0.171475 0.218574 0.191478 0.252306 0.246138 0.334810 0.210580 0.224280 0.219574 0.352353 0.289717
chargesum: 0.00000
title: Mulliken charges with hydrogens summed into heavy atoms:
elementType: O N C C C C C C C C C C C C C
charge: -0.139483 -0.038457 0.005368 0.027916 0.007881 -0.159560 -0.108957 0.326753 -0.020754 0.226578 0.265172 -0.120944 -0.202910 -0.072729 0.004126
polarizability: 2.07963042e+02 -7.17029491e+00 1.49625276e+02 1.32001473e+01 1.41909310e+01 1.07077430e+02
1716.lowfreq: -15.0488 -4.7020 -0.0007 -0.0005 0.0004 7.3993 40.0937 65.0681 82.9260
frequency: 40.0770 64.9715 82.8927 92.7589 171.3720 190.9772 223.0909 263.2108 299.7960 319.2448 359.7183 388.1174 398.8068 415.3370 419.3935 428.5578 443.7276 500.6806 515.7762 531.9733 571.2247 585.6757 606.4295 654.7842 677.5010 750.1954 754.1011 781.2271 787.0482 830.2851 843.8434 847.8042 867.5450 903.2691 922.2806 943.4084 967.0359 971.4469 1007.7228 1030.8342 1049.0237 1056.5951 1088.9392 1095.0766 1105.3896 1129.9955 1139.0968 1168.5784 1173.3555 1220.5106 1235.7717 1248.3237 1264.6622 1282.2599 1305.0024 1309.2441 1320.2827 1327.5776 1338.1238 1341.2710 1353.3452 1389.6349 1453.5714 1458.5532 1461.0645 1464.3142 1468.8890 1474.0857 1493.3067 1576.4676 1614.6095 1629.2413 1658.7140 2931.7357 2940.6574 2963.3800 2968.0159 2974.5855 2984.5460 3027.3003 3033.5881 3043.6611 3069.7445 3112.0172 3130.8494 3140.5852 3164.1403 3497.9383 3553.4111 3664.4415
redmass: 3.8538 3.4079 3.5567 4.1374 3.4889 2.6412 3.4164 3.2517 2.4913 2.9258 3.8918 2.0010 1.3847 2.6431 1.1756 3.0817 2.2835 2.8238 2.7039 4.9158 4.5954 1.8394 1.6421 5.7527 3.8422 1.6880 2.3877 1.6738 2.8207 3.4718 1.5057 1.4688 3.0655 2.4098 1.4030 1.3580 1.3130 2.8258 3.2379 1.9570 1.9943 2.0114 1.1643 1.5156 2.0337 1.7743 1.4498 1.3382 1.1977 1.5249 1.6231 1.3758 1.2794 1.6548 1.4137 1.6836 1.5743 1.6620 1.5078 1.5774 1.5630 7.5216 2.5757 1.1160 1.1047 1.0996 1.0974 1.0985 2.8814 5.4881 2.2493 1.8800 7.2982 1.0594 1.0692 1.0624 1.0787 1.0611 1.0812 1.0960 1.1029 1.1038 1.0916 1.0865 1.0874 1.0940 1.1002 1.0477 1.0644 1.1007
irintensity: 0.5146 0.0920 0.5823 0.7274 0.9092 1.0800 7.3412 12.9633 4.6707 0.7830 4.3113 20.5779 19.0417 6.3567 118.8447 0.6897 5.4173 4.1791 13.6414 5.7181 1.9485 81.3168 119.6029 11.3443 5.3820 52.2841 44.4389 0.4300 6.9828 0.6513 15.2511 0.6363 17.3536 8.3609 3.5466 4.8461 0.5105 25.1215 48.9511 9.6544 32.9042 6.4914 2.3426 0.6728 15.4263 1.6408 29.2642 35.3473 43.1053 5.2740 15.1605 2.9649 7.7257 5.1894 0.5582 20.7839 9.6866 16.6684 9.1373 3.5797 4.7380 13.7422 41.6465 1.5814 8.6145 9.7541 22.7497 1.8805 55.4650 9.4530 26.3253 255.5453 40.3669 53.6268 34.6993 30.0765 41.4597 34.6269 70.9742 78.9785 33.6108 91.8554 20.5952 15.2015 2.5000 40.6261 24.8536 83.9074 1.6999 47.4587
temp: 298.150 k
press: 1.00000 atm
elementType: 8 7 6 6 6 6 6 6 6 6 6 6 6 6 6 1 1 1 1 1 1 1 1 1 1 1 1 1 1 1 1 1
symmnumber: 1
zpe: 713869.2 jmol-1
zpe.correction: 0.271898 hartree
zpe.thermalcorrener: 0.285744 hartree
zpe.thermalcorrenthalpy: 0.286689 hartree
zpe.thermalcorrgfe: 0.231603 hartree
zpe.sumelectzpe: -634.432499 hartree
zpe.sumelectthermal: -634.418653 hartree
zpe.sumelectthermalent: -634.417709 hartree
zpe.sumelectthermalfe: -634.472794 hartree
dipole: -1.9703 1.1805 0.6723
dipole: 2.3933
quadrupole: -82.2531 -81.9579 -91.7375
quadrupole: -0.4078 6.7327 4.6454
quadrupole: 3.0631 3.3583 -6.4213 -0.4078 6.7327 4.6454
hfenergy: -634.7043972 hartree
pointgroup: C01 [X(C13H17N1O1)]
dipole: 0.8308648 0.010041 0.4428899 debye
polarizability: 207.1614527|-16.3386331|104.8966667|-6.3042494|-8.1960256|152.6076289 unknown
InChI: InChI=1S/C13H17NO/c14-12-9-5-4-8-11(12)13(15)10-6-2-1-3-7-10/h4-5,8-9,15H,1-3,6-7,14H2
charge 0 multiplicity 1
32 atoms
O  0.232487 -1.708303 1.497056
N  -1.607589 0.066007 2.547382
C  3.917607 1.025765 -0.732013
C  3.820384 -0.06967 0.353942
C  2.547378 1.702886 -0.955386
C  2.719154 -1.10502 -0.008841
C  1.440808 0.668342 -1.312141
C  1.369667 -0.440795 -0.270717
C  0.22092 -0.771071 0.404765
C  -1.155346 -0.273212 0.146119
C  -2.021238 0.142764 1.2189
C  -1.645455 -0.207082 -1.184555
C  -3.307518 0.671235 0.90039
C  -2.922889 0.305647 -1.489653
C  -3.74868 0.759188 -0.432427
H  4.678586 1.778198 -0.448098
H  4.259505 0.566028 -1.683053
H  3.574007 0.399201 1.327577
H  4.793915 -0.584488 0.4716
H  2.618517 2.456877 -1.763339
H  2.249856 2.241181 -0.033045
H  2.687703 -1.890325 0.776117
H  3.033103 -1.633628 -0.93528
H  1.678125 0.235651 -2.30891
H  0.472645 1.186487 -1.406437
H  -1.006675 -0.584849 -1.990635
H  1.157854 -2.02244 1.657237
H  -3.961033 1.00317 1.717277
H  -3.271433 0.342071 -2.526594
H  -4.744682 1.164663 -0.645448
H  -0.831111 -0.560145 2.764888
H  -2.252071 0.335163 3.286121
