program: Gaussian 09
title: 000278348
version: EM64L-G09RevD.01
frameworkgroup: C1[X(C14H13NO)]
method: RPBEPBE
basis: SDD
operation: Freq
keyword: #p
keyword: freq=noraman
keyword: PBEPBE/SDD
title: #p freq=noraman PBEPBE/SDD
converged: YES YES NO NO
title: Mulliken charges:
elementType: O N C C C C C C C C C C C C C C H H H H H H H H H H H H H
charge: -0.434308 -0.020517 0.274314 -0.584309 0.167074 -0.328751 0.428646 -0.406009 -0.261499 -0.204274 -0.335065 -0.381038 -0.369436 -0.227666 -0.219324 -0.234268 0.257178 0.223178 0.237722 0.218657 0.229449 0.206146 0.227688 0.226258 0.274078 0.225534 0.225977 0.227484 0.357080
chargesum: 0.00000
title: Mulliken charges with hydrogens summed into heavy atoms:
elementType: O N C C C C C C C C C C C C C C
charge: -0.077228 -0.020517 0.274314 -0.103953 0.167074 -0.091029 0.428646 -0.187352 -0.032049 0.023413 -0.128919 -0.154779 -0.095358 -0.002132 0.006653 -0.006784
polarizability: 2.16165580e+02 8.76660078e+00 1.51834919e+02 -4.06692930e+00 6.43565418e+00 1.19071205e+02
1716.lowfreq: -10.6347 0.0006 0.0006 0.0007 3.5244 4.9572 24.1804 30.0754 47.4884
frequency: 24.0332 29.9343 47.4819 90.8011 122.5641 161.1126 176.6409 263.0516 276.1049 295.7894 361.1517 379.2214 398.8217 405.8125 426.9299 476.3192 503.2369 523.3662 551.1173 596.0701 614.5928 656.2531 700.6084 718.3036 754.7055 766.0641 772.1000 825.4470 843.5377 858.8190 874.1384 898.9461 927.9260 937.6978 940.5972 974.1069 985.5750 988.7890 1000.7723 1010.1263 1022.3507 1039.9208 1077.4865 1079.6508 1151.7064 1170.3721 1170.9897 1178.3784 1198.8409 1220.8055 1231.7396 1243.9342 1303.7360 1311.6695 1316.7658 1368.1421 1392.7936 1395.3602 1433.0451 1437.6067 1444.9122 1481.5251 1492.4118 1585.3026 1602.6696 1610.1525 1612.2164 1630.9780 2956.5652 2993.5152 3044.1205 3110.7834 3115.7831 3122.7311 3126.6676 3140.3043 3142.4088 3155.0886 3165.7689 3165.9696 3584.7249
redmass: 4.7923 4.0184 5.1447 4.4669 4.9295 5.0608 4.4302 4.5918 3.0796 2.2933 1.1267 4.5987 4.6116 2.8336 3.6115 3.9206 2.8123 4.6128 5.2910 5.6614 6.4639 4.8612 1.8199 3.8791 1.4119 1.7581 3.5253 3.9700 1.6336 1.2506 3.5279 1.7131 2.9756 1.5296 1.9036 1.3219 1.3731 6.2794 1.4304 1.4978 2.0995 2.1383 2.1288 1.5731 1.2439 1.0674 1.0581 1.1083 2.2694 1.3314 2.4306 2.2799 1.3574 1.3159 1.3222 1.8535 6.7998 3.4027 1.5097 2.3271 1.4756 2.4003 2.5302 6.2188 6.4097 6.0260 6.7347 6.5176 1.0859 1.0616 1.0995 1.0885 1.0867 1.0888 1.0870 1.0921 1.0921 1.0959 1.1002 1.1003 1.0661
irintensity: 0.1315 0.0492 1.1572 0.0763 0.3362 1.5393 9.5158 6.8606 10.0743 4.8210 130.3979 2.2548 0.1691 0.0958 4.3639 16.5534 11.8301 9.7089 0.5122 7.8946 0.0293 6.8661 47.3225 6.9210 91.0169 35.4088 22.5497 17.9732 2.4381 0.1581 15.2633 2.3848 13.0074 1.5222 2.1369 0.1102 0.5236 0.0573 2.0574 6.7727 8.2381 3.9682 124.1568 10.1785 51.3598 2.0760 1.7346 6.1526 20.7325 1.9895 16.9910 35.5146 11.4107 22.3598 39.6981 2.5883 9.3228 0.7890 25.3186 24.5773 19.0381 7.3122 25.6082 9.9726 23.4472 3.7517 9.4026 45.9890 38.5350 27.8920 4.6435 15.1283 7.4180 4.1697 1.0253 27.2091 19.5590 24.3644 37.9892 12.1561 31.4354
temp: 298.150 k
press: 1.00000 atm
elementType: 8 7 6 6 6 6 6 6 6 6 6 6 6 6 6 6 1 1 1 1 1 1 1 1 1 1 1 1 1
symmnumber: 1
zpe: 605242.0 jmol-1
zpe.correction: 0.230525 hartree
zpe.thermalcorrener: 0.244352 hartree
zpe.thermalcorrenthalpy: 0.245296 hartree
zpe.thermalcorrgfe: 0.187963 hartree
zpe.sumelectzpe: -670.117771 hartree
zpe.sumelectthermal: -670.103944 hartree
zpe.sumelectthermalent: -670.103000 hartree
zpe.sumelectthermalfe: -670.160333 hartree
dipole: 1.7351 2.1841 1.2033
dipole: 3.0379
quadrupole: -80.8399 -90.9644 -86.5630
quadrupole: 2.6151 4.3384 2.3641
quadrupole: 5.2826 -4.8420 -0.4406 2.6151 4.3384 2.3641
hfenergy: -670.3482959 hartree
pointgroup: C01 [X(C14H13N1O1)]
dipole: 0.5973311 -0.3778253 0.9638206 debye
polarizability: 215.2230356|-2.3349509|117.6239357|11.660527|-1.5034834|154.2247325 unknown
InChI: InChI=1S/C14H13NO/c16-14-9-5-4-8-13(14)11-15-10-12-6-2-1-3-7-12/h1-10,16H,11H2
charge 0 multiplicity 1
29 atoms
O  2.035578 -2.34557 -0.665193
N  -0.179552 0.170186 -1.686045
C  2.206109 0.055191 -0.694596
C  1.291622 0.092169 -1.91024
C  2.560554 -1.176567 -0.080327
C  2.718247 1.24391 -0.121492
C  -2.136215 0.194742 -0.23528
C  3.405395 -1.219654 1.05451
C  3.558063 1.223021 1.015767
C  3.90215 -0.016202 1.602071
C  -0.67688 0.131916 -0.48054
C  -2.617541 0.160043 1.100731
C  -3.069004 0.286957 -1.305242
C  -4.003484 0.216597 1.366872
C  -4.451089 0.343325 -1.038744
C  -4.924091 0.308388 0.29758
H  1.451741 -0.808963 -2.530812
H  1.549206 0.962713 -2.544235
H  2.448514 2.202586 -0.581845
H  3.673961 -2.183696 1.506914
H  3.941966 2.158609 1.43515
H  -0.045191 0.053443 0.429507
H  4.555842 -0.050526 2.480512
H  -1.901106 0.088963 1.929308
H  -2.680064 0.311116 -2.328458
H  -4.364749 0.189156 2.401035
H  -5.16496 0.413866 -1.8674
H  -6.00016 0.352009 0.500945
H  2.33974 -3.15143 -0.179152
