program: Gaussian 09
title: 000278412
version: EM64L-G09RevD.01
frameworkgroup: C1[X(C22H19FN2O)]
method: RPBEPBE
basis: SDD
operation: Freq
keyword: #p
keyword: freq=noraman
keyword: PBEPBE/SDD
title: #p freq=noraman PBEPBE/SDD
converged: YES YES NO NO
title: Mulliken charges:
elementType: F O N N C C C C C C C C C C C C C C C C C C C C C C H H H H H H H H H H H H H H H H H H H
charge: -0.201944 -0.290118 -0.497254 -0.389433 0.085621 0.180350 0.157948 0.398371 0.199959 0.210108 -0.592527 -0.435248 -0.475972 -0.363113 -0.842573 -0.399830 -0.374872 -0.254180 -0.215286 0.164974 0.279431 -0.324971 -0.303842 -0.368334 -0.387779 0.333069 0.233741 0.212552 0.314692 0.238474 0.245767 0.224388 0.263175 0.224707 0.244479 0.237639 0.234559 0.233697 0.224284 0.224123 0.325661 0.282998 0.225083 0.259641 0.257786
chargesum: 0.00000
title: Mulliken charges with hydrogens summed into heavy atoms:
elementType: F O N N C C C C C C C C C C C C C C C C C C C C C C
charge: -0.201944 -0.290118 -0.182562 -0.063772 0.085621 0.180350 0.157948 0.398371 0.199959 0.210108 -0.146234 -0.196775 -0.230205 0.124450 -0.135748 -0.165271 -0.141175 -0.029895 0.008836 0.164974 0.279431 -0.041973 -0.078759 -0.108693 -0.129993 0.333069
polarizability: 3.47410455e+02 4.75395871e+01 2.99104531e+02 -3.33885057e+01 1.93163954e+01 1.56035028e+02
1716.lowfreq: -7.0799 -3.3838 -0.0004 -0.0003 0.0009 3.3811 11.9555 16.7010 22.4935
frequency: 11.7334 16.4493 22.3682 36.8761 54.8082 61.4559 94.4459 100.7531 110.9309 117.9159 159.9128 174.3537 202.7731 241.9784 261.8944 300.8587 308.4214 314.8248 315.5279 336.3192 371.8541 383.8586 394.2019 411.6605 430.0480 462.7769 482.7985 492.3368 501.3468 513.5762 528.2584 542.5976 562.8504 577.0280 580.9756 583.6600 601.7939 626.2739 650.8256 674.4081 692.4632 730.9491 742.7282 749.4258 754.7605 768.6683 777.9837 810.8320 818.8340 830.9839 837.6265 851.4827 856.6330 869.0615 876.4453 920.4937 936.0083 944.2158 953.0096 971.2886 973.9514 984.8013 1001.5928 1009.0110 1016.0409 1035.0134 1060.4118 1074.5404 1087.7894 1106.2679 1120.5413 1141.9416 1157.4518 1167.8690 1174.5001 1186.6004 1205.2237 1221.2821 1223.8393 1240.7512 1249.0147 1271.7917 1275.0393 1298.7219 1320.8643 1324.6381 1337.7093 1352.5707 1376.8565 1381.7130 1398.1217 1405.4488 1416.5284 1426.4863 1457.3215 1464.6006 1474.5452 1480.1439 1480.8247 1484.3176 1488.8756 1506.5684 1510.3062 1575.2856 1586.3368 1591.1900 1608.3008 1613.1245 1618.5162 1636.8018 2962.4798 2978.4862 2998.6646 3028.6013 3057.0676 3074.9407 3101.7647 3120.6260 3126.7336 3128.9817 3134.1053 3147.1955 3148.5250 3160.3159 3165.4534 3175.9305 3180.5329 3547.7233 3615.7571
redmass: 5.4283 5.8316 4.8671 5.4511 5.1918 4.3134 1.2588 5.1183 5.0212 3.4453 4.4006 3.5351 3.9315 4.3086 5.3184 3.4866 4.6486 5.5246 5.5613 4.7686 5.7011 2.7691 3.8745 2.9561 3.2071 3.5799 1.3873 2.4832 3.0660 3.0451 4.4484 3.7930 4.6632 3.3113 6.3867 1.4139 5.4124 6.8570 3.5759 4.2072 5.5641 4.1090 2.1425 4.1091 2.0480 3.3975 4.0896 2.1458 1.4881 2.1653 4.0762 1.6373 1.5249 2.5317 2.7862 3.9451 1.3962 1.3773 1.3536 2.3182 1.3123 1.3539 2.5834 2.0911 2.0061 1.5236 3.4229 2.9489 2.0275 1.3046 1.6270 2.4907 1.4685 1.1559 1.5924 1.4212 2.3872 1.5471 1.4602 1.8903 2.0321 2.0011 2.3854 1.3425 1.5275 2.2218 2.1246 1.3891 6.1703 3.5322 1.2511 4.0513 3.3174 3.2583 2.7566 1.3745 1.3099 1.5700 1.1504 2.3351 1.2880 2.6466 2.2890 7.7672 6.8470 7.3029 6.4873 7.2924 6.6950 7.9265 1.0408 1.0671 1.0611 1.0976 1.0998 1.0965 1.0934 1.0870 1.0852 1.0899 1.0893 1.0954 1.0963 1.0889 1.1002 1.0952 1.0972 1.0767 1.0799
irintensity: 0.2840 0.9729 1.3608 1.9252 0.7350 7.0228 0.0912 1.4385 2.1772 0.5444 0.2643 1.0591 6.9899 1.7400 9.2958 0.6869 4.7406 1.1485 1.5202 2.9546 2.4133 3.4752 1.8304 0.5857 6.6824 0.9557 84.2507 8.4887 3.9937 10.3258 0.9671 7.8310 5.3199 12.9188 27.6568 110.1121 1.0459 0.2233 4.0594 15.1118 2.9458 1.5672 53.2457 18.1034 46.6969 9.0348 26.0584 21.0542 6.8019 9.3817 2.8737 55.7274 0.2233 16.2503 7.5357 2.8768 2.5881 0.6858 0.2957 10.7658 0.0399 1.9556 23.3052 20.2370 3.3644 4.4003 9.5536 0.6192 5.8177 23.2592 10.4888 11.2784 63.4573 3.5477 1.6134 10.1787 19.6109 30.8503 5.3784 28.7718 13.4980 145.4928 46.4577 17.6938 7.7651 5.9428 95.0132 19.2762 3.5092 23.4046 14.4474 0.0566 14.5346 14.3437 26.3276 32.0764 194.1154 160.7764 42.8910 5.7000 27.1943 1.9064 158.5779 92.4441 10.3202 1.3157 96.2488 93.8078 34.1898 3.3849 33.6111 44.5297 40.6918 23.8141 25.7325 8.7562 18.6955 13.9115 1.1381 10.0128 2.3881 11.8735 34.5553 0.0487 34.8362 2.2181 5.2848 42.3640 44.1336
temp: 298.150 k
press: 1.00000 atm
elementType: 9 8 7 7 6 6 6 6 6 6 6 6 6 6 6 6 6 6 6 6 6 6 6 6 6 6 1 1 1 1 1 1 1 1 1 1 1 1 1 1 1 1 1 1 1
symmnumber: 1
zpe: 931696.5 jmol-1
zpe.correction: 0.354864 hartree
zpe.thermalcorrener: 0.377085 hartree
zpe.thermalcorrenthalpy: 0.378029 hartree
zpe.thermalcorrgfe: 0.299939 hartree
zpe.sumelectzpe: -1132.555071 hartree
zpe.sumelectthermal: -1132.532850 hartree
zpe.sumelectthermalent: -1132.531906 hartree
zpe.sumelectthermalfe: -1132.609996 hartree
dipole: 5.0938 -0.9268 -1.2392
dipole: 5.3237
quadrupole: -159.2823 -150.5065 -149.2707
quadrupole: -7.5552 -9.9362 7.7746
quadrupole: -6.2625 2.5133 3.7492 -7.5552 -9.9362 7.7746
hfenergy: -1132.9099351 hartree
pointgroup: C01 [X(C22H19F1N2O1)]
dipole: 2.0095716 0.3863072 0.4464902 debye
polarizability: 349.4543166|-46.4779222|298.5683205|29.9202704|19.3574118|154.5273766 unknown
InChI: InChI=1S/C22H19FN2O/c1-14-15(12-13-24-22(26)16-6-9-17(23)10-7-16)8-11-19-18-4-2-3-5-20(18)25-21(14)19/h2-11,24-25H,12-13H2,1H3
charge 0 multiplicity 1
45 atoms
F  -5.703214 -3.786228 0.451899
O  -4.275019 2.478333 0.319049
N  3.858403 0.88523 0.861524
N  -2.106648 1.63403 0.308872
C  2.68549 0.992074 0.092347
C  2.536374 -0.216073 -0.669492
C  1.773628 2.076085 0.036126
C  0.656807 1.925413 -0.835194
C  3.670648 -1.073185 -0.341257
C  4.471778 -0.355893 0.614451
C  -0.426198 2.993758 -0.951758
C  1.423096 -0.340559 -1.530472
C  0.503278 0.724562 -1.600808
C  -1.454965 2.946486 0.214855
C  2.034627 3.307259 0.887948
C  4.081199 -2.360492 -0.760585
C  5.658133 -0.895993 1.152768
C  5.267575 -2.908216 -0.227836
C  6.045296 -2.182603 0.718216
C  -3.482221 1.48109 0.319549
C  -4.004708 0.063901 0.343524
C  -5.371375 -0.110504 0.683466
C  -3.220587 -1.076727 0.024122
C  -5.950635 -1.393981 0.726379
C  -3.782881 -2.370805 0.058073
C  -5.136593 -2.497369 0.414685
H  -0.976327 2.858918 -1.90035
H  0.00911 4.010629 -0.977786
H  4.208733 1.594745 1.500302
H  1.279771 -1.23895 -2.140576
H  -0.353084 0.652384 -2.282161
H  -0.949466 3.184594 1.172192
H  -2.257019 3.688973 0.062853
H  3.072906 3.670963 0.756178
H  1.365907 4.143652 0.633247
H  1.894862 3.093164 1.966508
H  3.489552 -2.925832 -1.489182
H  6.263325 -0.344141 1.880327
H  5.597876 -3.90361 -0.543514
H  6.962539 -2.630537 1.116532
H  -1.496461 0.816413 0.357486
H  -5.96153 0.784564 0.902995
H  -2.172736 -0.979483 -0.283288
H  -7.00115 -1.544675 0.990406
H  -3.196497 -3.259768 -0.19072
