program: Gaussian 09
title: 000278353
version: EM64L-G09RevD.01
frameworkgroup: C1[X(C11H14N2O4)]
method: RPBEPBE
basis: SDD
operation: Freq
keyword: #p
keyword: freq=noraman
keyword: PBEPBE/SDD
title: #p freq=noraman PBEPBE/SDD
converged: YES YES NO NO
title: Mulliken charges:
elementType: O O O O N N C C C C C C C C C C C H H H H H H H H H H H H H H
charge: -0.202985 -0.221895 -0.258527 -0.207889 -0.274959 0.016920 -0.332712 -0.487647 -0.028733 0.212628 0.156015 -0.696920 -0.365452 0.264665 -0.159845 -0.236055 -0.677417 0.313398 0.254823 0.249421 0.240783 0.271620 0.211881 0.236289 0.292074 0.244293 0.275411 0.229510 0.217989 0.224583 0.238735
chargesum: 0.00000
title: Mulliken charges with hydrogens summed into heavy atoms:
elementType: O O O O N N C C C C C C C C C C C
charge: -0.202985 -0.221895 -0.258527 -0.207889 -0.030666 0.016920 -0.019314 0.016597 0.212050 0.212628 0.156015 0.022870 -0.073379 0.264665 -0.159845 0.268866 0.003890
polarizability: 1.56437142e+02 -6.40167162e+00 1.40804276e+02 -5.47781235e+00 -6.43784186e+00 1.19156710e+02
1716.lowfreq: -9.5700 -7.7009 -6.9706 -0.0009 -0.0007 -0.0006 22.1458 37.4948 48.9930
frequency: 21.9978 37.2810 48.9848 61.4351 84.9070 93.1663 95.3409 113.3941 119.6653 150.4501 165.7172 188.2628 238.7639 246.3774 259.6969 309.6222 327.9551 335.0945 382.0197 396.4072 407.1037 453.5300 460.5666 538.7081 575.5471 623.1161 663.9929 686.4664 705.0039 748.7905 764.7164 801.8560 807.1031 818.4491 855.0433 897.7173 901.5742 908.6149 943.2497 991.6327 1010.4706 1026.8214 1038.9949 1064.7201 1093.2879 1113.2667 1114.7224 1125.3574 1131.7737 1140.7768 1167.5250 1215.9122 1229.7683 1257.2448 1258.5584 1268.1440 1291.7332 1318.5812 1338.4235 1352.6573 1362.7277 1390.8495 1401.0159 1461.0604 1463.2796 1464.9754 1475.2143 1480.9005 1483.5239 1630.5198 1646.6467 1678.3441 2201.1209 2987.9979 2997.2836 3025.3242 3031.0856 3038.7161 3043.8937 3053.9288 3086.7813 3088.4902 3095.3430 3104.6090 3110.9354 3115.5908 3335.9057
redmass: 4.5091 3.7752 4.9039 4.2146 4.8597 3.7563 4.2349 8.3541 6.9485 5.6743 2.6235 4.4838 1.4579 1.4402 1.9993 4.8848 3.1512 3.9630 4.2361 5.2537 3.4017 7.0150 6.1013 5.6495 8.0013 7.4546 7.1113 4.1747 5.5481 4.8158 3.4073 2.6720 1.2779 3.4498 2.3675 2.5549 3.3619 2.5695 2.0134 2.7223 2.7967 2.7822 1.8667 1.9852 6.0605 1.8952 2.1375 3.0567 2.0933 1.4983 1.4686 1.2462 1.3161 1.2721 1.2063 1.6237 1.4317 1.4180 1.3731 1.5495 1.3426 1.2284 1.2669 1.0778 1.0399 1.0501 1.0691 1.0531 1.0656 6.8469 10.0853 12.0034 12.5708 1.0360 1.0359 1.0593 1.0680 1.0832 1.0827 1.0849 1.0979 1.1033 1.0987 1.1033 1.1025 1.1054 1.0771
irintensity: 2.5013 2.4123 2.7230 0.9278 3.6804 0.1323 2.6099 0.9049 1.1875 2.5534 7.9460 3.7862 0.8657 0.4461 7.5975 9.2448 5.8920 2.0177 1.7094 11.7140 2.2374 1.8902 6.1231 30.0560 5.5960 8.7590 4.9975 1.6522 0.9871 13.2741 9.9450 0.4237 6.4854 1.8972 37.5825 25.6337 16.7258 26.2747 12.0499 5.2634 26.2079 59.2717 33.2417 63.1299 270.4840 37.5896 10.7727 237.7835 66.4215 13.6247 140.5557 6.7525 4.3372 30.0694 31.3504 63.9336 13.2176 11.2284 5.1546 41.9981 4.2667 37.1566 25.5071 11.3818 11.4121 8.4325 2.6390 5.9954 17.0510 122.8333 159.8654 298.4760 6.8187 23.3202 18.3758 17.8890 10.0592 0.6549 1.7121 29.9860 23.5601 7.3196 19.8617 5.7618 14.3881 28.3877 6.0045
temp: 298.150 k
press: 1.00000 atm
elementType: 8 8 8 8 7 7 6 6 6 6 6 6 6 6 6 6 6 1 1 1 1 1 1 1 1 1 1 1 1 1 1
symmnumber: 1
zpe: 628303.4 jmol-1
zpe.correction: 0.239308 hartree
zpe.thermalcorrener: 0.257201 hartree
zpe.thermalcorrenthalpy: 0.258146 hartree
zpe.thermalcorrgfe: 0.191589 hartree
zpe.sumelectzpe: -836.652783 hartree
zpe.sumelectthermal: -836.634890 hartree
zpe.sumelectthermalent: -836.633946 hartree
zpe.sumelectthermalfe: -836.700502 hartree
dipole: -0.9787 -0.9662 3.0259
dipole: 3.3238
quadrupole: -80.9534 -119.7158 -99.5030
quadrupole: -8.8709 7.3817 4.0237
quadrupole: 19.1040 -19.6584 0.5544 -8.8709 7.3817 4.0237
hfenergy: -836.8920914 hartree
pointgroup: C01 [X(C11H14N2O4)]
dipole: -0.4790934 -0.5373419 1.0916857 debye
polarizability: 155.7550603|-6.5339067|143.4645585|-5.244022|-2.0865681|117.1785083 unknown
InChI: InChI=1S/C11H14N2O4/c1-3-16-10(14)8(5-12)9(13)7-4-6(2)17-11(7)15/h6-8,13H,3-4H2,1-2H3
charge 0 multiplicity 1
31 atoms
O  -2.344682 -1.353631 -1.152396
O  -0.045246 -1.581246 -1.228737
O  2.450852 -0.641722 0.471974
O  2.153683 0.796143 -1.350865
N  -1.021704 0.312054 1.898579
N  0.97634 3.866131 0.27623
C  -1.070219 0.604188 -0.531851
C  -2.568738 0.999878 -0.546883
C  -3.365361 -0.331467 -0.716028
C  -1.047371 -0.880598 -1.004225
C  -0.384908 0.697988 0.833551
C  -4.050108 -0.842217 0.552716
C  1.072394 1.262878 0.839322
C  1.959051 0.476767 -0.161379
C  1.04123 2.699878 0.516049
C  3.136128 -1.652341 -0.412962
C  3.580879 -2.7935 0.492012
H  -0.483525 1.18226 -1.2671
H  -2.860267 1.504719 0.386824
H  -2.766882 1.680123 -1.391738
H  -4.076406 -0.279597 -1.558023
H  -3.337673 -0.849532 1.395053
H  -4.895517 -0.177241 0.810527
H  -4.445698 -1.860156 0.395626
H  1.497172 1.12325 1.849918
H  -0.477067 0.395752 2.780879
H  2.391579 -1.962406 -1.16504
H  3.979292 -1.145044 -0.914341
H  4.077861 -3.570569 -0.116705
H  4.294468 -2.445353 1.25856
H  2.714445 -3.253784 0.996056
