program: Gaussian 09
title: 000278360
version: EM64L-G09RevD.01
frameworkgroup: C1[X(C14H20N2O2)]
method: RPBEPBE
basis: SDD
operation: Freq
keyword: #p
keyword: freq=noraman
keyword: PBEPBE/SDD
title: #p freq=noraman PBEPBE/SDD
converged: YES YES NO NO
title: Mulliken charges:
elementType: O O N N C C C C C C C C C C C C C C H H H H H H H H H H H H H H H H H H H H
charge: -0.473712 -0.267956 -0.371842 -0.367339 -0.027554 -0.088036 -0.451646 -0.444357 -0.403388 -0.392143 -0.576785 0.206544 0.441505 -0.410097 -0.350348 -0.198991 -0.205223 -0.265921 0.221078 0.187324 0.254703 0.188824 0.186448 0.214293 0.195825 0.205783 0.195963 0.205710 0.254669 0.228065 0.338790 0.331167 0.309190 0.223606 0.238174 0.221939 0.220148 0.225587
chargesum: 0.00000
title: Mulliken charges with hydrogens summed into heavy atoms:
elementType: O O N N C C C C C C C C C C C C C C
charge: -0.134921 -0.267956 -0.040675 -0.058148 0.193524 0.099288 -0.008119 -0.043616 -0.001780 0.009530 -0.094051 0.206544 0.441505 -0.186491 -0.112174 0.022948 0.014925 -0.040334
polarizability: 2.42192826e+02 -3.42472215e+00 1.58110600e+02 -4.19713105e-01 1.15649882e+01 1.17352783e+02
1716.lowfreq: -16.3273 -8.1116 -0.0009 -0.0007 -0.0006 4.8543 13.4296 21.3504 28.3287
frequency: 10.8546 18.9977 25.7022 33.9432 50.3663 90.2616 123.7809 171.4595 189.6341 219.7466 237.6120 276.2719 281.0054 294.9391 319.9507 360.7778 378.3445 406.9629 408.1793 428.5281 448.5215 477.0063 483.3408 520.8000 536.4419 553.1202 612.5982 627.4746 653.6980 692.5269 723.7652 755.9165 785.9612 821.1959 822.2034 830.5387 841.2435 879.6997 884.7598 892.6923 919.7607 940.3608 959.1287 960.8418 978.7610 981.6784 1005.0022 1022.0704 1045.3080 1050.2599 1063.9692 1078.1080 1088.4407 1100.6442 1126.3633 1142.7818 1164.0222 1169.8332 1181.4936 1193.0439 1229.5635 1237.9972 1249.9716 1263.8652 1278.5369 1293.4666 1300.1295 1315.1739 1315.5155 1330.0254 1331.0181 1338.5441 1341.3337 1347.9653 1383.9755 1391.6254 1427.9704 1449.6832 1462.9037 1464.9610 1468.4797 1470.1853 1476.4686 1485.1114 1509.9883 1596.8769 1611.4529 1624.2110 2920.8126 2959.4035 2964.7609 2971.2732 2973.5372 2975.1395 3008.2128 3025.2255 3036.1084 3044.1861 3052.6404 3075.2533 3118.5542 3127.7600 3140.8586 3155.3012 3168.1880 3482.9797 3515.5260 3566.4846
redmass: 4.1540 5.1177 6.3122 4.2800 4.2537 3.8299 4.7789 2.4399 4.8934 3.3303 4.3469 2.8198 1.7014 1.5032 1.8435 2.8623 2.8215 2.8988 3.9689 3.5684 2.1990 3.2178 3.1943 3.0182 2.0052 1.2499 6.1985 3.9672 3.0332 1.9395 5.2731 1.7270 1.9714 1.6353 1.8390 2.1903 2.2059 2.0778 1.5054 1.7100 1.9361 4.1217 1.3773 2.3591 1.3006 5.9490 3.4543 2.1567 1.7322 1.4264 2.2589 1.8946 1.6308 1.8414 1.7499 2.1061 1.7913 1.0679 1.1106 1.5562 1.3202 1.5675 1.2999 1.4807 1.3747 1.8754 1.4477 1.2798 1.4084 1.3803 1.3375 1.4089 1.5539 1.5132 4.3683 1.6189 2.0614 1.9949 1.0947 1.0931 1.0926 1.1024 1.0939 2.4322 1.4733 5.8435 5.6887 5.9985 1.0827 1.0736 1.0602 1.0720 1.0630 1.0678 1.0589 1.1001 1.0969 1.1001 1.0990 1.1035 1.0862 1.0866 1.0932 1.0942 1.1009 1.0757 1.0791 1.0661
irintensity: 0.7702 1.3041 3.8733 0.0188 1.9463 2.1921 8.1000 0.2638 3.8636 7.1458 9.8006 17.1341 39.1061 77.5881 1.1513 15.7105 6.6120 0.8621 4.1356 3.3400 83.3758 10.1049 4.9403 32.9077 40.3169 119.9367 2.1627 39.5963 22.3838 35.5652 14.0234 87.4150 1.7399 4.5484 3.7810 4.2016 16.2574 3.2372 10.8220 6.5272 3.4204 12.1434 0.1358 20.8900 0.5797 0.6231 36.0651 5.8065 16.0261 20.2928 30.8948 10.3872 7.9461 4.8755 26.9315 26.1762 17.3588 2.0451 7.1617 1.1557 4.6212 41.0507 11.2644 47.3754 32.9089 10.9042 1.9610 10.8298 7.8336 14.1725 8.9792 0.3096 3.0227 5.2642 41.5099 0.6797 84.3812 102.3125 6.2006 8.3629 27.5700 6.9523 5.8513 108.7587 20.3860 51.2823 163.4280 93.2123 34.1770 6.4039 32.4499 21.8828 41.7981 60.3800 16.2245 47.7515 56.6905 52.4105 52.1763 15.5722 10.2471 1.3443 27.9001 35.1146 15.2747 27.0961 38.1409 3.4432
temp: 298.150 k
press: 1.00000 atm
elementType: 8 8 7 7 6 6 6 6 6 6 6 6 6 6 6 6 6 6 1 1 1 1 1 1 1 1 1 1 1 1 1 1 1 1 1 1 1 1
symmnumber: 1
zpe: 841105.7 jmol-1
zpe.correction: 0.320360 hartree
zpe.thermalcorrener: 0.338020 hartree
zpe.thermalcorrenthalpy: 0.338964 hartree
zpe.thermalcorrgfe: 0.271116 hartree
zpe.sumelectzpe: -804.057597 hartree
zpe.sumelectthermal: -804.039937 hartree
zpe.sumelectthermalent: -804.038993 hartree
zpe.sumelectthermalfe: -804.106841 hartree
dipole: 3.8252 2.2969 -1.2578
dipole: 4.6358
quadrupole: -91.9063 -104.4930 -111.7238
quadrupole: 5.2885 1.1892 8.1265
quadrupole: 10.8014 -1.7853 -9.0162 5.2885 1.1892 8.1265
hfenergy: -804.3779574 hartree
pointgroup: C01 [X(C14H20N2O2)]
dipole: 1.6151106 -0.7417432 -0.4094616 debye
polarizability: 240.1249185|13.4929225|120.3166492|6.1399266|14.6164081|157.2146409 unknown
InChI: InChI=1S/C14H20N2O2/c17-13-9-5-4-6-11(13)10-14(18)16-15-12-7-2-1-3-8-12/h1-3,7-8,11,13,15-17H,4-6,9-10H2
charge 0 multiplicity 1
38 atoms
O  3.028029 -1.101598 -1.752603
O  -0.401883 1.962752 0.674622
N  -0.796481 -0.173948 -0.146614
N  -1.915147 -0.37082 0.683452
C  2.464062 0.545239 -0.070991
C  3.59426 0.033578 -0.988188
C  2.984417 1.693587 0.831788
C  4.831361 -0.402402 -0.176343
C  4.223545 1.264421 1.650494
C  5.349373 0.745091 0.724576
C  1.224022 0.972428 -0.913719
C  -0.049507 1.004155 -0.079382
C  -3.216283 -0.385385 0.107005
C  -4.340371 -0.368934 0.978204
C  -3.419248 -0.487141 -1.293819
C  -5.643729 -0.447637 0.449145
C  -4.731551 -0.571651 -1.808765
C  -5.852126 -0.554284 -0.947623
H  2.178037 -0.313908 0.573035
H  3.887997 0.846612 -1.69254
H  2.168422 2.035762 1.493861
H  3.251748 2.560552 0.191173
H  5.63303 -0.742368 -0.864387
H  4.545686 -1.271621 0.449788
H  3.936532 0.464234 2.363341
H  4.589288 2.116288 2.254923
H  5.714925 1.579623 0.091118
H  6.213365 0.393326 1.319673
H  1.116164 0.271557 -1.760797
H  1.385363 1.987675 -1.318995
H  3.744432 -1.508463 -2.302051
H  -0.410002 -1.007984 -0.596462
H  -1.817528 0.134894 1.571465
H  -4.188532 -0.297034 2.062283
H  -2.55935 -0.477894 -1.970722
H  -6.501256 -0.427537 1.131486
H  -4.875932 -0.645135 -2.892973
H  -6.866833 -0.618827 -1.353858
