program: Gaussian 09
title: 000278344
version: EM64L-G09RevD.01
frameworkgroup: C1[X(C10H16O4)]
method: RPBEPBE
basis: SDD
operation: Freq
keyword: #pfreq=noraman
keyword: PBEPBE/SDD
title: #p freq=noraman PBEPBE/SDD
converged: YES YES NO NO
title: Mulliken charges:
elementType: O O O O C C C C C C C C C C H H H H H H H H H H H H H H H H
charge: -0.262299 -0.259909 -0.222944 -0.237389 -0.465891 0.556588 0.242257 0.264671 -0.826294 -0.259269 -0.263481 -0.730525 -0.663519 -0.661627 0.281897 0.214941 0.257558 0.265426 0.227202 0.235427 0.236177 0.224750 0.225809 0.225807 0.219101 0.250988 0.228114 0.216802 0.228814 0.250819
chargesum: 0.00000
title: Mulliken charges with hydrogens summed into heavy atoms:
elementType: O O O O C C C C C C C C C C
charge: -0.262299 -0.259909 -0.222944 -0.237389 -0.183994 0.556588 0.242257 0.264671 -0.088370 0.203360 0.197446 -0.278909 0.034685 0.034808
polarizability: 1.29177369e+02 2.58045978e+00 1.28614743e+02 -8.48669113e+00 -4.67002749e+00 1.07346366e+02
1716.lowfreq: -7.1528 -0.0008 0.0007 0.0009 6.6461 12.0493 23.8179 38.0368 52.2049
frequency: 22.6169 37.5708 52.0120 61.5201 70.8895 83.9337 103.6792 124.9938 160.0567 169.5069 188.8439 211.9636 221.1085 278.2656 290.2228 319.3403 335.3709 349.5025 413.9788 442.8945 477.5776 492.7987 569.9270 652.7663 672.9902 723.2950 739.2026 796.0540 802.2208 811.9499 819.6798 849.3394 913.9477 943.4187 949.0772 985.9088 1013.8785 1018.3336 1035.4231 1066.3427 1091.9488 1096.0603 1104.2736 1137.2630 1157.0408 1158.9156 1254.5067 1276.1953 1277.5843 1278.9090 1286.6369 1354.3473 1355.8493 1390.6340 1392.5169 1398.8321 1433.1244 1457.2779 1458.6463 1459.7730 1463.7246 1463.8159 1484.4387 1485.1170 1488.0125 1634.3811 1645.4505 1665.2004 2984.5480 2993.5328 2994.1308 3031.5433 3032.0935 3038.9180 3068.4472 3088.6070 3089.2663 3092.4611 3095.2634 3095.3901 3096.1144 3121.3139 3121.5921 3196.8286
redmass: 4.0551 4.3007 2.9745 2.8426 4.1369 3.3715 4.4872 3.7904 2.2555 3.6589 1.1199 1.3332 1.3637 3.0875 2.6331 3.1128 4.3166 5.2761 3.1535 3.6039 3.0709 2.9217 6.1150 2.4861 2.2369 2.5802 2.7249 1.8797 3.8026 1.2762 1.9295 3.9701 2.9088 3.0260 1.3328 1.7404 2.1618 2.9754 1.9304 1.5457 2.4701 2.1674 2.5289 3.7107 1.6706 1.6768 2.0706 1.4617 1.1382 1.1572 2.3300 1.2732 1.2909 1.2332 1.2304 1.2196 1.1933 1.0916 1.0879 1.0553 1.0468 1.0439 1.0527 1.0518 1.0595 8.4845 10.1457 4.9615 1.0360 1.0361 1.0362 1.0598 1.0599 1.0824 1.0969 1.0973 1.0974 1.0644 1.1029 1.1030 1.0989 1.1061 1.1063 1.1142
irintensity: 0.7573 1.5448 0.5757 0.7119 0.5061 1.2138 0.3952 1.6471 0.6318 1.5602 0.4492 1.8350 3.4482 5.0096 6.4304 9.9460 14.6880 1.6413 1.3027 3.1976 8.8656 3.9507 11.0625 12.5376 1.5898 8.3948 11.4953 2.0891 1.0705 5.3776 3.5157 1.1894 6.1775 24.4011 65.0356 1.3137 25.2408 117.3760 67.2961 6.6580 161.0526 43.9230 139.4653 272.6819 12.5696 20.6096 108.2926 88.0054 11.2334 21.9126 8.6199 1.0625 3.9197 25.0142 21.7620 43.1707 0.2168 14.5582 21.9118 8.6900 14.7251 13.1975 9.9817 12.0416 27.8402 123.0254 199.0779 17.7717 16.6613 20.4814 16.7048 28.5690 27.5678 3.2256 4.9209 33.3056 34.8085 8.7203 0.9009 0.8812 17.0207 28.7069 31.1264 19.6293
temp: 298.150 k
press: 1.00000 atm
elementType: 8 8 8 8 6 6 6 6 6 6 6 6 6 6 1 1 1 1 1 1 1 1 1 1 1 1 1 1 1 1
symmnumber: 1
zpe: 643369.2 jmol-1
zpe.correction: 0.245046 hartree
zpe.thermalcorrener: 0.261803 hartree
zpe.thermalcorrenthalpy: 0.262747 hartree
zpe.thermalcorrgfe: 0.198816 hartree
zpe.sumelectzpe: -690.439351 hartree
zpe.sumelectthermal: -690.422594 hartree
zpe.sumelectthermalent: -690.421650 hartree
zpe.sumelectthermalfe: -690.485581 hartree
dipole: 0.6599 -2.2850 -1.3498
dipole: 2.7347
quadrupole: -72.9470 -79.1430 -86.2293
quadrupole: 4.8929 -1.8815 -0.2188
quadrupole: 6.4928 0.2968 -6.7895 4.8929 -1.8815 -0.2188
hfenergy: -690.684397 hartree
pointgroup: C01 [X(C10H16O4)]
dipole: 0.3073375 0.9330739 0.4387422 debye
polarizability: 129.4026905|-1.9984764|127.7177281|7.9428045|-6.849495|108.0180601 unknown
InChI: InChI=1S/C10H16O4/c1-5-13-9(11)8(7(3)4)10(12)14-6-2/h8H,3,5-6H2,1-2,4H3
charge 0 multiplicity 1
30 atoms
O  -1.595616 1.209521 -0.17836
O  1.807712 1.227201 0.519139
O  -2.273502 -1.021186 -0.201469
O  1.188927 0.436614 -1.5895
C  0.052892 -0.409096 0.455682
C  0.466574 -1.887508 0.403342
C  -1.388893 -0.15843 -0.020271
C  1.043913 0.449245 -0.346582
C  0.324529 -2.615492 -0.91708
C  -2.964778 1.638581 -0.608396
C  2.873659 2.071779 -0.11041
C  0.97045 -2.470215 1.522756
C  -3.893231 1.783255 0.600027
C  4.160364 1.264154 -0.298917
H  0.102179 -0.057477 1.502103
H  0.775681 -3.620322 -0.861927
H  0.806744 -2.050227 -1.735947
H  -0.743269 -2.722372 -1.180768
H  -2.783085 2.600901 -1.112403
H  -3.350984 0.896942 -1.329324
H  2.491182 2.454338 -1.072925
H  3.000766 2.89848 0.606309
H  1.064847 -1.926123 2.469996
H  1.296557 -3.516295 1.520089
H  -4.869483 2.185718 0.271516
H  -4.068571 0.806196 1.080371
H  -3.466807 2.47858 1.343511
H  4.958658 1.921704 -0.690425
H  4.502828 0.838054 0.659714
H  4.005256 0.444278 -1.019851
