program: Gaussian 09
title: 000278334
version: EM64L-G09RevD.01
frameworkgroup: C1[X(C4H7NO5S2)]
method: RPBEPBE
basis: SDD
operation: Freq
keyword: #p
keyword: freq=noraman
keyword: PBEPBE/SDD
title: #p freq=noraman PBEPBE/SDD
converged: YES YES NO NO
title: Mulliken charges:
elementType: S S O O O O O N C C C C H H H H H H H
charge: 0.964560 0.955981 -0.512231 -0.533317 -0.536181 -0.512797 -0.408347 -0.025123 -0.699101 -0.762653 -0.663619 0.325658 0.336531 0.341347 0.330719 0.343766 0.332760 0.326682 0.395366
chargesum: 0.00000
title: Mulliken charges with hydrogens summed into heavy atoms:
elementType: S S O O O O O N C C C C
charge: 0.964560 0.955981 -0.512231 -0.533317 -0.536181 -0.512797 -0.012980 -0.025123 -0.021223 -0.088168 -0.004178 0.325658
polarizability: 1.48150932e+02 -2.15289102e+00 1.27068245e+02 -5.81992917e+00 -5.94834845e+00 9.68382307e+01
1716.lowfreq: -11.2364 0.0001 0.0011 0.0018 4.3703 10.6978 26.6659 56.6917 108.6475
frequency: 26.6005 56.6653 108.6454 141.5328 149.7560 169.3851 190.9427 212.2552 229.3167 245.3905 271.6792 311.4539 316.7345 329.1907 356.3305 409.9245 417.3509 495.0244 511.1989 523.3268 573.6064 598.8226 675.8039 749.4343 789.1232 796.4603 822.6075 880.0284 890.0963 917.0121 938.5895 965.9421 1047.5886 1099.4715 1126.0196 1143.6166 1222.4791 1227.9060 1260.4315 1320.6480 1322.4671 1386.8723 1409.2039 1573.9298 3036.1642 3041.8861 3062.4999 3116.0965 3160.1164 3200.8027 3557.9247
redmass: 4.3592 7.6037 5.1960 12.7874 8.4089 10.2213 5.8070 6.4173 6.1641 3.4520 6.2626 5.9712 7.9667 4.7298 6.3142 7.5493 2.2764 4.5795 1.6856 4.8500 3.9248 8.2148 4.8554 1.8335 8.2157 10.6244 3.7085 2.1637 2.5338 5.9230 5.7818 3.2632 1.1397 1.1683 1.1496 1.1508 1.2021 1.2144 2.2798 1.3627 1.3339 1.0854 1.2010 6.2299 1.0566 1.0597 1.0490 1.1068 1.1089 1.1188 1.0677
irintensity: 5.6626 5.1624 5.2343 1.6551 3.4163 4.1194 4.1741 0.6730 6.0031 6.0141 14.3012 37.2222 32.0124 7.4954 0.6756 12.4648 50.3798 32.6531 140.0932 25.5624 8.9540 32.7083 30.7950 14.8329 74.2776 49.2721 0.7648 33.7570 76.3354 58.1048 39.7722 129.4481 5.4121 29.8593 3.6045 7.3356 1.8519 17.2424 30.5919 24.4188 52.6411 36.6882 12.8012 2.0816 6.3291 2.9133 4.6409 3.4219 7.4980 9.8081 111.7439
temp: 298.150 k
press: 1.00000 atm
elementType: 16 16 8 8 8 8 8 7 6 6 6 6 1 1 1 1 1 1 1
symmnumber: 1
zpe: 313340.0 jmol-1
zpe.correction: 0.119345 hartree
zpe.thermalcorrener: 0.133106 hartree
zpe.thermalcorrenthalpy: 0.134051 hartree
zpe.thermalcorrgfe: 0.078479 hartree
zpe.sumelectzpe: -1382.270330 hartree
zpe.sumelectthermal: -1382.256569 hartree
zpe.sumelectthermalent: -1382.255625 hartree
zpe.sumelectthermalfe: -1382.311196 hartree
dipole: 3.8812 -1.0849 0.1831
dipole: 4.0342
quadrupole: -76.0497 -106.1945 -92.6748
quadrupole: -11.8130 1.2011 -5.3276
quadrupole: 15.5900 -14.5548 -1.0352 -11.8130 1.2011 -5.3276
hfenergy: -1382.3896752 hartree
pointgroup: C01 [X(C4H7N1O5S2)]
dipole: -1.2444956 0.9848953 0.0174214 debye
dipolederiv: 1.1307853 0.0330633 -0.0228411 0.3330475 1.4563773 -0.212541 -0.1317484 -0.0042238 1.113445 1.2891877 0.3715308 -0.1203996 -0.0198593 1.195426 -0.0473904 -0.1035727 -0.2417532 1.2113936 -0.8305969 -0.0435294 0.0385689 -0.0691541 -0.5572119 0.0432028 -0.0853235 -0.0784604 -0.4453947 -0.4370073 0.0412318 -0.0883723 -0.0711927 -0.5306496 0.0363228 0.1865854 0.0629341 -0.6431337 -0.4968893 -0.0448958 -0.0338172 0.005428 -0.5195675 -0.0368887 0.0369847 0.1382905 -0.6622415 -0.577895 -0.2024025 0.0343805 -0.0553085 -0.7020013 0.0281327 -0.0497615 -0.1014632 -0.4676201 -1.2568066 0.5358631 -0.1523268 -0.135388 0.0209311 -0.0261368 -0.4101898 0.2576517 -0.37678 0.7741524 -0.5225954 0.2643131 0.0602628 -0.2728325 -0.0110069 0.4615397 -0.2850961 -0.0357358 -0.3074638 -0.118716 0.0578886 -0.106607 -0.3908175 0.0785849 0.1226803 0.1273015 -0.2840967 0.143068 -0.1096231 0.009552 -0.0998029 -0.1126234 0.0625837 -0.0562194 0.006863 -0.1022879 -0.0729635 -0.1448215 -0.0329387 -0.0357391 -0.1264883 -0.0148838 -0.0444393 -0.0278369 -0.0597736 -0.0967559 0.2917249 -0.0792582 0.2253409 0.1122436 0.0069323 -0.0264486 0.1281174 -0.1058491 0.0384908 -0.0568079 0.0385911 -0.0440758 0.0134796 0.0186111 0.0165258 0.028141 0.0573389 0.0435751 -0.05642 0.014384 -0.0334379 0.0143957 0.0323555 0.0261401 0.0261442 0.0757376 0.0820817 0.0044311 0.0192742 -0.0354491 0.0550826 -0.0135362 0.0166296 -0.0000041 0.1166698 0.0045857 0.0747949 0.0370408 0.0777792 0.1209366 0.0346704 0.0321354 -0.0104238 0.0736795 0.0778799 -0.0230132 0.0211029 0.0314033 0.0458748 0.0080002 0.0038282 0.0289886 0.1020068 0.0866892 0.0463297 0.0092526 0.0532759 -0.0146872 0.0329676 0.0169393 -0.0203666 0.0459081 0.4058826 -0.076145 -0.0143949 -0.0805231 0.192132 -0.0199801 -0.0122853 -0.0348039 0.3867337 unknown
polarizability: 145.1042728|-7.7558731|131.4081602|2.499207|-4.2108923|95.5449744 unknown
InChI: InChI=1S/C4H7NO5S2/c6-5-4-1-11(7,8)3-12(9,10)2-4/h6H,1-3H2
charge 0 multiplicity 1
19 atoms
S  1.799092 0.446373 -0.281942
S  -0.340276 -1.761796 0.768227
O  3.347118 0.675136 0.16957
O  1.241441 0.854204 -1.761532
O  -0.072237 -1.591064 2.373461
O  -0.98518 -3.118384 0.137479
O  -2.797826 1.957221 -0.189022
N  -1.475809 2.216316 0.3479
C  1.386105 -1.458514 -0.091542
C  0.54574 1.214408 1.084604
C  -1.428064 -0.261624 0.181906
C  -0.832008 1.078714 0.547559
H  1.333959 -1.868567 -1.109854
H  2.129909 -1.905486 0.583572
H  0.871712 2.258998 1.185868
H  0.76348 0.595135 1.970393
H  -2.40459 -0.44938 0.659275
H  -1.515661 -0.400418 -0.909463
H  -3.187205 2.865431 -0.28346
