program: Gaussian 09
title: 000278356
version: EM64L-G09RevD.01
frameworkgroup: C1[X(C12H16N2O4)]
method: RPBEPBE
basis: SDD
operation: Freq
keyword: #p
keyword: freq=noraman
keyword: PBEPBE/SDD
title: #p freq=noraman PBEPBE/SDD
converged: YES YES NO NO
title: Mulliken charges:
elementType: O O O O N N C C C C C C C C C C C C H H H H H H H H H H H H H H H H
charge: -0.217883 -0.224161 -0.258516 -0.207996 -0.276441 0.016105 0.346548 -0.535940 -0.323408 0.197159 -0.715969 -0.716006 0.154829 -0.367318 0.265171 -0.160123 -0.235737 -0.677839 0.257474 0.247770 0.309844 0.216566 0.230698 0.237133 0.231157 0.277991 0.207490 0.291749 0.243981 0.275714 0.229010 0.217667 0.224372 0.238910
chargesum: 0.00000
title: Mulliken charges with hydrogens summed into heavy atoms:
elementType: O O O O N N C C C C C C C C C C C C
charge: -0.217883 -0.224161 -0.258516 -0.207996 -0.032460 0.016105 0.346548 -0.030697 -0.013563 0.197159 -0.031572 0.000631 0.154829 -0.075569 0.265171 -0.160123 0.268987 0.003110
polarizability: 1.71192890e+02 -6.80201483e+00 1.49691361e+02 -4.13960416e+00 -5.64196675e+00 1.31267358e+02
1716.lowfreq: -8.2502 -6.4820 0.0004 0.0007 0.0008 6.2417 23.8131 37.6115 48.7058
frequency: 23.6691 37.3062 48.6924 59.9200 77.5021 93.0121 97.1243 110.2996 118.3652 148.1559 164.2494 189.0605 202.8476 222.4890 249.0310 253.1043 296.3228 308.2077 325.9499 338.3801 360.5165 381.7391 400.5918 435.9016 456.5642 473.9529 536.1513 573.9932 577.3573 634.0484 665.1107 701.9241 745.6221 767.8501 791.9012 804.6177 809.5447 855.2098 870.8918 902.3644 906.2677 926.5233 957.9774 961.1628 997.0559 1008.1841 1022.5079 1029.4373 1077.1253 1096.0501 1114.0254 1124.0548 1139.7876 1143.3400 1156.3387 1168.7997 1226.9531 1249.1154 1258.0748 1259.8072 1266.2339 1286.3287 1308.6501 1352.5270 1361.7073 1383.8558 1399.3518 1400.8981 1454.5340 1461.2243 1462.9199 1463.3635 1474.4937 1476.6395 1483.6792 1487.1666 1630.9548 1646.8940 1673.2820 2201.3473 2985.8007 2990.8964 2997.2296 3025.6433 3026.1989 3036.5521 3039.3603 3083.5698 3089.1327 3089.8063 3095.4264 3097.2220 3103.2105 3104.9859 3116.5139 3335.7599
redmass: 4.5649 3.8925 4.4993 4.1860 4.7464 5.0221 3.1153 8.8649 6.7217 6.4281 2.5071 4.3952 1.0569 4.1726 1.1654 1.3167 4.7967 2.4930 4.4371 2.5363 3.3802 4.2593 6.3784 2.9693 7.2691 4.6815 4.7008 5.1117 7.4435 6.1693 6.5774 5.7798 5.0855 4.4014 4.5670 1.5539 1.8321 2.3052 3.1789 3.0178 2.7244 1.9049 1.8149 1.8581 2.1819 1.5710 2.2669 2.8857 2.2146 5.2399 2.4162 3.0609 1.4893 1.7451 1.5942 1.5064 1.5255 2.0588 1.1523 1.4880 1.6180 2.0688 1.5772 1.5647 1.3448 1.2325 1.2077 1.2664 1.0577 1.0761 1.0399 1.0533 1.0746 1.0589 1.0614 1.0528 6.8865 10.1904 11.7761 12.5709 1.0356 1.0361 1.0360 1.0673 1.0596 1.0830 1.0798 1.0989 1.1029 1.0997 1.0989 1.1015 1.1017 1.1018 1.1054 1.0771
irintensity: 2.5399 2.6088 1.7273 1.4876 1.5663 0.0319 2.0816 1.9018 1.3571 3.5143 6.7141 3.8044 0.4244 0.4359 0.2809 1.7257 12.9768 1.9125 10.9370 1.7115 1.7070 1.6569 8.8004 1.8193 5.3012 4.6082 27.3989 18.7550 2.1405 3.6704 4.8205 1.9390 11.2570 9.5655 1.4304 2.8851 5.1336 12.6821 67.4377 17.3471 18.4790 8.9892 7.8694 3.9739 6.6668 6.5568 44.6728 47.6757 48.1463 315.4418 27.4575 242.8174 5.1291 57.8524 71.9397 101.9003 12.3134 62.3017 11.1850 42.8169 60.9918 15.3222 12.3958 43.2443 4.4008 31.9071 28.4793 25.3723 5.3585 13.4850 10.9197 4.9813 3.8330 0.7408 15.4604 13.5723 129.1347 167.7473 301.5271 6.9671 16.8815 23.5059 18.6327 17.5839 16.6012 0.5450 3.5276 6.8244 8.5823 28.5237 18.3302 10.2534 19.3466 10.3870 28.3498 6.2760
temp: 298.150 k
press: 1.00000 atm
elementType: 8 8 8 8 7 7 6 6 6 6 6 6 6 6 6 6 6 6 1 1 1 1 1 1 1 1 1 1 1 1 1 1 1 1
symmnumber: 1
zpe: 698771.6 jmol-1
zpe.correction: 0.266148 hartree
zpe.thermalcorrener: 0.285540 hartree
zpe.thermalcorrenthalpy: 0.286484 hartree
zpe.thermalcorrgfe: 0.217164 hartree
zpe.sumelectzpe: -875.883271 hartree
zpe.sumelectthermal: -875.863878 hartree
zpe.sumelectthermalent: -875.862934 hartree
zpe.sumelectthermalfe: -875.932254 hartree
dipole: -1.0933 -0.9129 2.9904
dipole: 3.3123
quadrupole: -86.7006 -124.3637 -106.9787
quadrupole: -10.3431 7.9943 5.3306
quadrupole: 19.3137 -18.3494 -0.9644 -10.3431 7.9943 5.3306
hfenergy: -876.1494187 hartree
pointgroup: C01 [X(C12H16N2O4)]
dipole: -0.5624532 -0.5831311 1.020702 debye
polarizability: 171.0847162|-6.8124826|152.0116859|-1.8269327|-1.3829344|129.0552059 unknown
InChI: InChI=1S/C12H16N2O4/c1-4-17-10(15)8(6-13)9(14)7-5-12(2,3)18-11(7)16/h7-8,14H,4-5H2,1-3H3
charge 0 multiplicity 1
34 atoms
O  -2.107326 -1.264736 -1.025841
O  0.185003 -1.531972 -1.152127
O  2.753362 -0.675359 0.467713
O  2.416766 0.809357 -1.310149
N  -0.637161 0.291934 2.050923
N  1.341528 3.85775 0.421584
C  -3.117857 -0.237128 -0.528233
C  -2.274376 1.06588 -0.319621
C  -0.783822 0.646891 -0.368169
C  -0.8021 -0.82269 -0.885859
C  -4.168438 -0.106404 -1.638028
C  -3.698013 -0.796675 0.779519
C  -0.041833 0.696822 0.969053
C  1.42239 1.242455 0.927872
C  2.258612 0.465293 -0.122209
C  1.398991 2.686028 0.634963
C  3.385469 -1.678433 -0.463835
C  3.837539 -2.849252 0.398673
H  -2.528693 1.535063 0.64326
H  -2.485518 1.786996 -1.127319
H  -0.216749 1.236874 -1.109912
H  -4.920113 0.652358 -1.353929
H  -3.70222 0.20213 -2.590094
H  -4.6874 -1.066703 -1.798532
H  -4.102389 -1.81039 0.616126
H  -2.920152 -0.832845 1.560719
H  -4.519248 -0.145447 1.13195
H  1.884803 1.076591 1.917843
H  -0.053685 0.346396 2.910368
H  2.608184 -1.955367 -1.195369
H  4.221182 -1.177071 -0.983364
H  4.298056 -3.621364 -0.244121
H  4.583467 -2.533079 1.14812
H  2.979543 -3.304303 0.921523
